geronimo-dev mailing list archives

Site index · List index
Message view « Date » · « Thread »
Top « Date » · « Thread »
From ga...@apache.org
Subject [BUILD] trunk: Failed for Revision: 983848
Date Tue, 10 Aug 2010 02:48:43 GMT
Geronimo Revision: 983848 built with tests included
 
See the full build-2100.log file at http://people.apache.org/builds/geronimo/server/binaries/trunk/20100809/build-2100.log
 
Download the binaries from http://people.apache.org/builds/geronimo/server/binaries/trunk/20100809
[INFO] BUILD SUCCESSFUL
[INFO] ------------------------------------------------------------------------
[INFO] Total time: 43 minutes 10 seconds
[INFO] Finished at: Mon Aug 09 21:44:28 EDT 2010
[INFO] Final Memory: 495M/1005M
[INFO] ------------------------------------------------------------------------
 
TESTSUITE RESULTS (Failures only)
=================================
 
Assembly: tomcat
=================================
See full test results and logs at http://people.apache.org/builds/geronimo/server/binaries/trunk/20100809/logs-2100-tomcat/
 
Running TestSuite
Tests run: 1, Failures: 1, Errors: 0, Skipped: 0, Time elapsed: 0.454 sec <<< FAILURE!
--
Running TestSuite
Tests run: 22, Failures: 14, Errors: 0, Skipped: 0, Time elapsed: 7.723 sec <<< FAILURE!
--
Running TestSuite
Tests run: 1, Failures: 1, Errors: 0, Skipped: 0, Time elapsed: 0.448 sec <<< FAILURE!
 
Assembly: jetty
=================================
See full test results and logs at http://people.apache.org/builds/geronimo/server/binaries/trunk/20100809/logs-2100-jetty/
 
 
[INFO]   Geronimo TestSuite :: Aries Testsuite :: Simple EBA
[INFO]   Geronimo TestSuite :: Aries Testsuite :: JPA Test
[INFO]   Geronimo TestSuite :: Aries Testsuite :: JPA PU
[INFO]   Geronimo TestSuite :: Aries Testsuite :: JPA WAB
[INFO]   Geronimo TestSuite :: Aries Testsuite :: JPA EBA
[INFO]   Geronimo TestSuite :: Java EE 6 New Features Testsuite
[INFO]   Geronimo TestSuite :: Javaee6 Testsuite :: beanvalidation-test
[INFO]   Geronimo TestSuite :: Java EE 6 Testsuite :: commonannotation1.1-test
[INFO] ------------------------------------------------------------------------
[INFO] Building Geronimo TestSuite
[INFO]    task-segment: [install]
[INFO] ------------------------------------------------------------------------
[INFO] [genesis:validate-configuration {execution: default}]
[INFO] [geronimo-property:set-property {execution: set-property}]
[INFO] [enforcer:enforce {execution: default}]
[INFO] Setting property: classpath.resource.loader.class => 'org.codehaus.plexus.velocity.ContextClassLoaderResourceLoader'.
[INFO] Setting property: velocimacro.messages.on => 'false'.
[INFO] Setting property: resource.loader => 'classpath'.
[INFO] Setting property: resource.manager.logwhenfound => 'false'.
[INFO] [remote-resources:process {execution: default}]
[INFO] [site:attach-descriptor {execution: default-attach-descriptor}]
[INFO] [ianal:verify-legal-files {execution: default}]
[INFO] [install:install {execution: default-install}]
[INFO] Installing /home/geronimo/geronimo/trunk/testsuite/pom.xml to /home/geronimo/.m2/repository/org/apache/geronimo/testsuite/testsuite/3.0-SNAPSHOT/testsuite-3.0-SNAPSHOT.pom
[INFO] ------------------------------------------------------------------------
[INFO] Building Geronimo TestSuite :: Commands TestSuite
[INFO]    task-segment: [install]
[INFO] ------------------------------------------------------------------------
[INFO] [genesis:validate-configuration {execution: default}]
[INFO] [geronimo-property:set-property {execution: set-property}]
[INFO] [enforcer:enforce {execution: default}]
[INFO] [remote-resources:process {execution: default}]
[INFO] [site:attach-descriptor {execution: default-attach-descriptor}]
[INFO] [ianal:verify-legal-files {execution: default}]
[INFO] [install:install {execution: default-install}]
[INFO] Installing /home/geronimo/geronimo/trunk/testsuite/commands-testsuite/pom.xml to /home/geronimo/.m2/repository/org/apache/geronimo/testsuite/commands-testsuite/3.0-SNAPSHOT/commands-testsuite-3.0-SNAPSHOT.pom
[INFO] ------------------------------------------------------------------------
[INFO] Building Geronimo TestSuite :: Commands Testsuite :: Deployer
[INFO]    task-segment: [install]
[INFO] ------------------------------------------------------------------------
[INFO] [genesis:validate-configuration {execution: default}]
[INFO] [geronimo-property:set-property {execution: set-property}]
[INFO] [enforcer:enforce {execution: default}]
[INFO] [remote-resources:process {execution: default}]
[INFO] [resources:resources {execution: default-resources}]
[INFO] Using 'UTF-8' encoding to copy filtered resources.
[INFO] skip non existing resourceDirectory /home/geronimo/geronimo/trunk/testsuite/commands-testsuite/deploy/src/main/resources
[INFO] skip non existing resourceDirectory /home/geronimo/geronimo/trunk/testsuite/commands-testsuite/deploy/src/main/filtered-resources
[INFO] Copying 3 resources
[INFO] [compiler:compile {execution: default-compile}]
[INFO] No sources to compile
[INFO] [resources:testResources {execution: default-testResources}]
[INFO] Using 'UTF-8' encoding to copy filtered resources.
[INFO] Copying 1 resource
[INFO] skip non existing resourceDirectory /home/geronimo/geronimo/trunk/testsuite/commands-testsuite/deploy/src/test/filtered-resources
[INFO] Copying 3 resources
[INFO] [compiler:testCompile {execution: default-testCompile}]
[INFO] Compiling 2 source files to /home/geronimo/geronimo/trunk/testsuite/commands-testsuite/deploy/target/test-classes
[INFO] [surefire:test {execution: default-test}]
[INFO] Tests are skipped.
[INFO] [jar:jar {execution: default-jar}]
[INFO] Building jar: /home/geronimo/geronimo/trunk/testsuite/commands-testsuite/deploy/target/deploy-3.0-SNAPSHOT.jar
[org.codehaus.mojo.pluginsupport.logging.Logging] : Initialized
[INFO] [geronimo:start-server {execution: start-geronimo}]
[INFO] Using assembly configuration: jetty
[INFO] snapshot org.apache.geronimo.assemblies:geronimo-jetty8-javaee6:3.0-SNAPSHOT: checking
for updates from codehaus.snapshots
[INFO] snapshot org.apache.geronimo.assemblies:geronimo-jetty8-javaee6:3.0-SNAPSHOT: checking
for updates from apache.snapshots
[INFO] Using assembly artifact: org.apache.geronimo.assemblies:geronimo-jetty8-javaee6:zip:bin:3.0-SNAPSHOT:provided
[INFO] Using geronimoHome: /home/geronimo/geronimo/trunk/testsuite/commands-testsuite/deploy/target/geronimo-jetty8-javaee6-3.0-SNAPSHOT
[INFO] Installing assembly...
[INFO] Expanding: /home/geronimo/.m2/repository/org/apache/geronimo/assemblies/geronimo-jetty8-javaee6/3.0-SNAPSHOT/geronimo-jetty8-javaee6-3.0-SNAPSHOT-bin.zip
into /home/geronimo/geronimo/trunk/testsuite/commands-testsuite/deploy/target
[INFO] Starting Geronimo server...
[INFO] Selected option set: default
[INFO] Redirecting output to: /home/geronimo/geronimo/trunk/testsuite/commands-testsuite/deploy/target/geronimo-logs/org.apache.geronimo.mavenplugins.geronimo.server.StartServerMojo.log
[INFO] Waiting for Geronimo server...
[org.apache.geronimo.mavenplugins.geronimo.ServerProxy] : Initialized with URL: service:jmx:rmi://localhost/jndi/rmi://localhost:1099/JMXConnector,
environment: {jmx.remote.credentials=[Ljava.lang.String;@12c4d93}
[org.apache.geronimo.mavenplugins.geronimo.ServerProxy] : Connecting to: service:jmx:rmi://localhost/jndi/rmi://localhost:1099/JMXConnector
[org.apache.geronimo.mavenplugins.geronimo.ServerProxy] : Connection failure; ignoring: java.io.IOException:
Failed to retrieve RMIServer stub: javax.naming.ServiceUnavailableException [Root exception
is java.rmi.ConnectException: Connection refused to host: localhost; nested exception is:

	java.net.ConnectException: Connection refused]
[org.apache.geronimo.mavenplugins.geronimo.ServerProxy] : Connecting to: service:jmx:rmi://localhost/jndi/rmi://localhost:1099/JMXConnector
[org.apache.geronimo.mavenplugins.geronimo.ServerProxy] : Connection failure; ignoring: java.io.IOException:
Failed to retrieve RMIServer stub: javax.naming.ServiceUnavailableException [Root exception
is java.rmi.ConnectException: Connection refused to host: localhost; nested exception is:

	java.net.ConnectException: Connection refused]
[org.apache.geronimo.mavenplugins.geronimo.ServerProxy] : Connecting to: service:jmx:rmi://localhost/jndi/rmi://localhost:1099/JMXConnector
[org.apache.geronimo.mavenplugins.geronimo.ServerProxy] : Connection failure; ignoring: java.io.IOException:
Failed to retrieve RMIServer stub: javax.naming.ServiceUnavailableException [Root exception
is java.rmi.ConnectException: Connection refused to host: localhost; nested exception is:

	java.net.ConnectException: Connection refused]
[org.apache.geronimo.mavenplugins.geronimo.ServerProxy] : Connecting to: service:jmx:rmi://localhost/jndi/rmi://localhost:1099/JMXConnector
[org.apache.geronimo.mavenplugins.geronimo.ServerProxy] : Connection failure; ignoring: java.io.IOException:
Failed to retrieve RMIServer stub: javax.naming.NameNotFoundException: JMXConnector
[org.apache.geronimo.mavenplugins.geronimo.ServerProxy] : Connecting to: service:jmx:rmi://localhost/jndi/rmi://localhost:1099/JMXConnector
[org.apache.geronimo.mavenplugins.geronimo.ServerProxy] : Connected
[INFO] Geronimo server started in 0:00:41.472
[WARNING] DEPRECATED [systemProperties]: Use systemPropertyVariables instead.
[INFO] [failsafe:integration-test {execution: integration-test}]
[INFO] Failsafe report directory: /home/geronimo/geronimo/trunk/testsuite/commands-testsuite/deploy/target/failsafe-reports

-------------------------------------------------------
 T E S T S
-------------------------------------------------------
Running TestSuite
killed.
[INFO] ------------------------------------------------------------------------
[ERROR] BUILD ERROR
 
Samples: trunk
=================================
Log: http://people.apache.org/builds/geronimo/server/binaries/trunk/20100809/samples-2100.log
 
Build status: FAILED
 

Mime
View raw message