geronimo-dev mailing list archives

Site index · List index
Message view « Date » · « Thread »
Top « Date » · « Thread »
From ga...@apache.org
Subject [BUILD] branches/2.2: Failed for Revision: 983070
Date Fri, 06 Aug 2010 21:00:06 GMT
Geronimo Revision: 983070 built with tests included
 
See the full build-1400.log file at http://people.apache.org/builds/geronimo/server/binaries/2.2/20100806/build-1400.log
 
Download the binaries from http://people.apache.org/builds/geronimo/server/binaries/2.2/20100806
[INFO] BUILD SUCCESSFUL
[INFO] ------------------------------------------------------------------------
[INFO] Total time: 48 minutes 43 seconds
[INFO] Finished at: Fri Aug 06 14:55:30 EDT 2010
[INFO] Final Memory: 343M/989M
[INFO] ------------------------------------------------------------------------
 
TESTSUITE RESULTS (Failures only)
=================================
 
Assembly: tomcat
=================================
See full test results and logs at http://people.apache.org/builds/geronimo/server/binaries/2.2/20100806/logs-1400-tomcat/
 
[INFO] Running TestSuite
[INFO] Tests run: 40, Failures: 31, Errors: 0, Skipped: 0, Time elapsed: 180.067 sec <<<
FAILURE!
[INFO] Running TestSuite
[INFO] Tests run: 12, Failures: 9, Errors: 0, Skipped: 0, Time elapsed: 77.376 sec <<<
FAILURE!
--
[INFO] Running TestSuite
[INFO] Tests run: 7, Failures: 5, Errors: 0, Skipped: 0, Time elapsed: 7.818 sec <<<
FAILURE!
--
[INFO] Running TestSuite
[INFO] Tests run: 36, Failures: 1, Errors: 0, Skipped: 0, Time elapsed: 70.034 sec <<<
FAILURE!
 
Assembly: jetty
=================================
See full test results and logs at http://people.apache.org/builds/geronimo/server/binaries/2.2/20100806/logs-1400-jetty/
 
[INFO] Running TestSuite
[INFO] Tests run: 116, Failures: 3, Errors: 0, Skipped: 113, Time elapsed: 16.755 sec <<<
FAILURE!
[INFO] Running TestSuite
[INFO] Tests run: 12, Failures: 10, Errors: 0, Skipped: 0, Time elapsed: 70.955 sec <<<
FAILURE!
--
[INFO] Running TestSuite
[INFO] Tests run: 2, Failures: 2, Errors: 0, Skipped: 0, Time elapsed: 7.862 sec <<<
FAILURE!
[INFO] Running TestSuite
[INFO] Tests run: 7, Failures: 5, Errors: 0, Skipped: 0, Time elapsed: 7.702 sec <<<
FAILURE!
--
[INFO] Running TestSuite
[INFO] Tests run: 36, Failures: 1, Errors: 0, Skipped: 0, Time elapsed: 17.353 sec <<<
FAILURE!
 
Samples: branches/2.2
=================================
Log: http://people.apache.org/builds/geronimo/server/binaries/2.2/20100806/samples-1400.log
 
Build status: OK
 

Mime
View raw message