geronimo-dev mailing list archives

Site index · List index
Message view « Date » · « Thread »
Top « Date » · « Thread »
From ga...@apache.org
Subject [BUILD] branches/2.2: Failed for Revision: 982934
Date Fri, 06 Aug 2010 14:49:00 GMT
Geronimo Revision: 982934 built with tests included
 
See the full build-0800.log file at http://people.apache.org/builds/geronimo/server/binaries/2.2/20100806/build-0800.log
 
Download the binaries from http://people.apache.org/builds/geronimo/server/binaries/2.2/20100806
[INFO] BUILD SUCCESSFUL
[INFO] ------------------------------------------------------------------------
[INFO] Total time: 38 minutes 5 seconds
[INFO] Finished at: Fri Aug 06 08:44:12 EDT 2010
[INFO] Final Memory: 347M/1013M
[INFO] ------------------------------------------------------------------------
 
TESTSUITE RESULTS (Failures only)
=================================
 
Assembly: tomcat
=================================
See full test results and logs at http://people.apache.org/builds/geronimo/server/binaries/2.2/20100806/logs-0800-tomcat/
 
[INFO] Running TestSuite
[INFO] Tests run: 40, Failures: 31, Errors: 0, Skipped: 0, Time elapsed: 184.965 sec <<<
FAILURE!
[INFO] Running TestSuite
[INFO] Tests run: 12, Failures: 8, Errors: 0, Skipped: 0, Time elapsed: 72.696 sec <<<
FAILURE!
--
[INFO] Running TestSuite
[INFO] Tests run: 7, Failures: 5, Errors: 0, Skipped: 0, Time elapsed: 7.785 sec <<<
FAILURE!
--
[INFO] Running TestSuite
[INFO] Tests run: 36, Failures: 1, Errors: 0, Skipped: 0, Time elapsed: 69.345 sec <<<
FAILURE!
 
Assembly: jetty
=================================
See full test results and logs at http://people.apache.org/builds/geronimo/server/binaries/2.2/20100806/logs-0800-jetty/
 
[INFO] Running TestSuite
[INFO] Tests run: 40, Failures: 27, Errors: 0, Skipped: 0, Time elapsed: 197.285 sec <<<
FAILURE!
[INFO] Running TestSuite
[INFO] Tests run: 12, Failures: 10, Errors: 0, Skipped: 0, Time elapsed: 57.235 sec <<<
FAILURE!
--
[INFO] Running TestSuite
[INFO] Tests run: 2, Failures: 2, Errors: 0, Skipped: 0, Time elapsed: 9.052 sec <<<
FAILURE!
[INFO] Running TestSuite
[INFO] Tests run: 7, Failures: 5, Errors: 0, Skipped: 0, Time elapsed: 7.773 sec <<<
FAILURE!
--
[INFO] Running TestSuite
[INFO] Tests run: 36, Failures: 1, Errors: 0, Skipped: 0, Time elapsed: 17.593 sec <<<
FAILURE!
 
Samples: branches/2.2
=================================
Log: http://people.apache.org/builds/geronimo/server/binaries/2.2/20100806/samples-0800.log
 
Build status: FAILED
 

Mime
View raw message