geronimo-dev mailing list archives

Site index · List index
Message view « Date » · « Thread »
Top « Date » · « Thread »
From ga...@apache.org
Subject [BUILD] branches/2.2: Failed for Revision: 982087
Date Wed, 04 Aug 2010 07:09:39 GMT
Geronimo Revision: 982087 built with tests included
 
See the full build-2000.log file at http://people.apache.org/builds/geronimo/server/binaries/2.2/20100803/build-2000.log
 
Download the binaries from http://people.apache.org/builds/geronimo/server/binaries/2.2/20100803
[INFO] BUILD SUCCESSFUL
[INFO] ------------------------------------------------------------------------
[INFO] Total time: 43 minutes 2 seconds
[INFO] Finished at: Tue Aug 03 20:50:15 EDT 2010
[INFO] Final Memory: 330M/926M
[INFO] ------------------------------------------------------------------------
 
TESTSUITE RESULTS (Failures only)
=================================
 
Assembly: tomcat
=================================
See full test results and logs at http://people.apache.org/builds/geronimo/server/binaries/2.2/20100803/logs-2000-tomcat/
 
 
[INFO] Scanning for projects...
[INFO] Reactor build order: 
[INFO]   Geronimo TestSuite
[INFO]   Geronimo TestSuite :: Commands TestSuite
[INFO]   Geronimo TestSuite :: Concurrent TestSuite
[INFO]   Geronimo TestSuite :: Console Testsuite
[INFO]   Geronimo TestSuite :: CORBA TestSuite
[INFO]   Geronimo TestSuite :: Deployment Testsuite
[INFO]   Geronimo TestSuite :: Enterprise Testsuite
[INFO]   Geronimo TestSuite :: Security Testsuite
[INFO]   Geronimo TestSuite :: Web-tier Testsuite
[INFO]   Geronimo TestSuite :: WebServices TestSuite
[INFO] ------------------------------------------------------------------------
[INFO] Building Geronimo TestSuite
[INFO]    task-segment: [install]
[INFO] ------------------------------------------------------------------------
Downloading: http://maven.rtp.raleigh.ibm.com/nexus-proxy//org/apache/maven/plugins/maven-deploy-plugin/2.4/maven-deploy-plugin-2.4.pom
6K downloaded
Downloading: http://maven.rtp.raleigh.ibm.com/nexus-proxy//org/apache/maven/plugins/maven-deploy-plugin/2.4/maven-deploy-plugin-2.4.jar
33K downloaded
[INFO] snapshot org.apache.geronimo.buildsupport:testsuite-maven-plugin:2.2.2-SNAPSHOT: checking
for updates from apache.snapshots
[INFO] snapshot org.apache.geronimo.buildsupport:testsuite-maven-plugin:2.2.2-SNAPSHOT: checking
for updates from codehaus.snapshots
[INFO] snapshot org.apache.geronimo.buildsupport:buildsupport:2.2.2-SNAPSHOT: checking for
updates from apache.snapshots
[INFO] snapshot org.apache.geronimo.buildsupport:buildsupport:2.2.2-SNAPSHOT: checking for
updates from codehaus.snapshots
[INFO] snapshot org.apache.geronimo.framework:framework:2.2.2-SNAPSHOT: checking for updates
from apache.snapshots
[INFO] snapshot org.apache.geronimo.framework:framework:2.2.2-SNAPSHOT: checking for updates
from codehaus.snapshots
[INFO] [genesis:validate-configuration {execution: default}]
[INFO] snapshot org.apache.geronimo.testsupport:testsupport-selenium:2.2.2-SNAPSHOT: checking
for updates from codehaus.snapshots
[INFO] snapshot org.apache.geronimo.testsupport:testsupport-selenium:2.2.2-SNAPSHOT: checking
for updates from apache.snapshots
[INFO] snapshot org.apache.geronimo.testsupport:testsupport:2.2.2-SNAPSHOT: checking for updates
from openqa-snapshots
[INFO] snapshot org.apache.geronimo.testsupport:testsupport:2.2.2-SNAPSHOT: checking for updates
from codehaus.snapshots
[INFO] snapshot org.apache.geronimo.testsupport:testsupport:2.2.2-SNAPSHOT: checking for updates
from apache.snapshots
[INFO] snapshot org.apache.geronimo.testsupport:testsupport-common:2.2.2-SNAPSHOT: checking
for updates from codehaus.snapshots
[INFO] snapshot org.apache.geronimo.testsupport:testsupport-common:2.2.2-SNAPSHOT: checking
for updates from apache.snapshots
[INFO] snapshot org.apache.geronimo.testsupport:testsupport-common:2.2.2-SNAPSHOT: checking
for updates from openqa-snapshots
[INFO] snapshot org.apache.geronimo.framework:modules:2.2.2-SNAPSHOT: checking for updates
from codehaus.snapshots
[INFO] snapshot org.apache.geronimo.framework:modules:2.2.2-SNAPSHOT: checking for updates
from apache.snapshots
[INFO] snapshot org.apache.geronimo.framework:modules:2.2.2-SNAPSHOT: checking for updates
from openqa-snapshots
[INFO] [enforcer:enforce {execution: default}]
[INFO] Setting property: classpath.resource.loader.class => 'org.codehaus.plexus.velocity.ContextClassLoaderResourceLoader'.
[INFO] Setting property: velocimacro.messages.on => 'false'.
[INFO] Setting property: resource.loader => 'classpath'.
[INFO] Setting property: resource.manager.logwhenfound => 'false'.
[INFO] [remote-resources:process {execution: default}]
[INFO] [site:attach-descriptor]
[INFO] [ianal:verify-legal-files {execution: default}]
[INFO] [install:install]
[INFO] Installing /home/geronimo/geronimo/2.2/testsuite/pom.xml to /home/geronimo/.m2/repository/org/apache/geronimo/testsuite/testsuite/2.2.2-SNAPSHOT/testsuite-2.2.2-SNAPSHOT.pom
[INFO] ------------------------------------------------------------------------
[INFO] Building Geronimo TestSuite :: Commands TestSuite
[INFO]    task-segment: [install]
[INFO] ------------------------------------------------------------------------
Downloading: http://maven.rtp.raleigh.ibm.com/nexus-proxy//org/apache/geronimo/genesis/plugins/maven-maven-plugin/1.5/maven-maven-plugin-1.5.pom
1K downloaded
Downloading: http://maven.rtp.raleigh.ibm.com/nexus-proxy//org/apache/geronimo/genesis/plugins/plugins/1.5/plugins-1.5.pom
6K downloaded
Downloading: http://maven.rtp.raleigh.ibm.com/nexus-proxy//org/apache/geronimo/genesis/plugins/maven-maven-plugin/1.5/maven-maven-plugin-1.5.jar
11K downloaded
[INFO] [genesis:validate-configuration {execution: default}]
[INFO] snapshot org.apache.geronimo.testsupport:testsupport-commands:2.2.2-SNAPSHOT: checking
for updates from codehaus.snapshots
[INFO] snapshot org.apache.geronimo.testsupport:testsupport-commands:2.2.2-SNAPSHOT: checking
for updates from apache.snapshots
[INFO] snapshot org.apache.geronimo.framework:geronimo-deploy-jsr88:2.2.2-SNAPSHOT: checking
for updates from codehaus.snapshots
[INFO] snapshot org.apache.geronimo.framework:geronimo-deploy-jsr88:2.2.2-SNAPSHOT: checking
for updates from apache.snapshots
[INFO] snapshot org.apache.geronimo.framework:geronimo-cli:2.2.2-SNAPSHOT: checking for updates
from codehaus.snapshots
[INFO] snapshot org.apache.geronimo.framework:geronimo-cli:2.2.2-SNAPSHOT: checking for updates
from apache.snapshots
[INFO] snapshot org.apache.geronimo.framework:geronimo-crypto:2.2.2-SNAPSHOT: checking for
updates from codehaus.snapshots
[INFO] snapshot org.apache.geronimo.framework:geronimo-crypto:2.2.2-SNAPSHOT: checking for
updates from apache.snapshots
[INFO] snapshot org.apache.geronimo.framework:geronimo-common:2.2.2-SNAPSHOT: checking for
updates from codehaus.snapshots
[INFO] snapshot org.apache.geronimo.framework:geronimo-common:2.2.2-SNAPSHOT: checking for
updates from apache.snapshots
[INFO] snapshot org.apache.geronimo.framework:geronimo-plugin:2.2.2-SNAPSHOT: checking for
updates from codehaus.snapshots
[INFO] snapshot org.apache.geronimo.framework:geronimo-plugin:2.2.2-SNAPSHOT: checking for
updates from apache.snapshots
[INFO] snapshot org.apache.geronimo.framework:geronimo-deploy-config:2.2.2-SNAPSHOT: checking
for updates from codehaus.snapshots
[INFO] snapshot org.apache.geronimo.framework:geronimo-deploy-config:2.2.2-SNAPSHOT: checking
for updates from apache.snapshots
[INFO] [enforcer:enforce {execution: default}]
[INFO] [remote-resources:process {execution: default}]
[INFO] [site:attach-descriptor]
[INFO] [geronimo:start-server {execution: start}]
[INFO] Using assembly configuration: tomcat
[INFO] snapshot org.apache.geronimo.assemblies:geronimo-tomcat6-javaee5:2.2.2-SNAPSHOT: checking
for updates from codehaus.snapshots
[INFO] snapshot org.apache.geronimo.assemblies:geronimo-tomcat6-javaee5:2.2.2-SNAPSHOT: checking
for updates from apache.snapshots
[INFO] Using assembly artifact: org.apache.geronimo.assemblies:geronimo-tomcat6-javaee5:zip:bin:2.2.2-SNAPSHOT:provided
[INFO] Using geronimoHome: /home/geronimo/geronimo/2.2/testsuite/commands-testsuite/target/geronimo-tomcat6-javaee5-2.2.2-SNAPSHOT
[INFO] Installing assembly...
[INFO] Expanding: /home/geronimo/.m2/repository/org/apache/geronimo/assemblies/geronimo-tomcat6-javaee5/2.2.2-SNAPSHOT/geronimo-tomcat6-javaee5-2.2.2-SNAPSHOT-bin.zip
into /home/geronimo/geronimo/2.2/testsuite/commands-testsuite/target
[INFO] Starting Geronimo server...
[INFO] Selected option set: default
[INFO] Redirecting output to: /home/geronimo/geronimo/2.2/testsuite/commands-testsuite/target/geronimo-logs/org.apache.geronimo.mavenplugins.geronimo.server.StartServerMojo.log
[INFO] Waiting for Geronimo server...
[INFO] ------------------------------------------------------------------------
[ERROR] BUILD ERROR
 
Assembly: jetty
=================================
See full test results and logs at http://people.apache.org/builds/geronimo/server/binaries/2.2/20100803/logs-2000-jetty/
 
[INFO] Running TestSuite
[INFO] Tests run: 116, Failures: 3, Errors: 0, Skipped: 113, Time elapsed: 20.497 sec <<<
FAILURE!
[INFO] Running TestSuite
[INFO] Tests run: 12, Failures: 9, Errors: 0, Skipped: 0, Time elapsed: 69.981 sec <<<
FAILURE!
--
[INFO] Running TestSuite
[INFO] Tests run: 2, Failures: 2, Errors: 0, Skipped: 0, Time elapsed: 7.857 sec <<<
FAILURE!
--
[INFO] Running TestSuite
[INFO] Tests run: 36, Failures: 1, Errors: 0, Skipped: 0, Time elapsed: 17.382 sec <<<
FAILURE!
 
Samples: branches/2.2
=================================
Log: http://people.apache.org/builds/geronimo/server/binaries/2.2/20100803/samples-2000.log
 
Build status: FAILED
 

Mime
View raw message