geronimo-dev mailing list archives

Site index · List index
Message view « Date » · « Thread »
Top « Date » · « Thread »
From ga...@apache.org
Subject [BUILD] branches/2.2: Failed for Revision: 981709
Date Tue, 03 Aug 2010 15:44:08 GMT
Geronimo Revision: 981709 built with tests included
 
See the full build-2000.log file at http://people.apache.org/builds/geronimo/server/binaries/2.2/20100803/build-2000.log
 
Download the binaries from http://people.apache.org/builds/geronimo/server/binaries/2.2/20100803
[INFO] BUILD SUCCESSFUL
[INFO] ------------------------------------------------------------------------
[INFO] Total time: 29 minutes 56 seconds
[INFO] Finished at: Tue Aug 03 03:00:51 EDT 2010
[INFO] Final Memory: 325M/878M
[INFO] ------------------------------------------------------------------------
 
TESTSUITE RESULTS (Failures only)
=================================
 
Assembly: tomcat
=================================
See full test results and logs at http://people.apache.org/builds/geronimo/server/binaries/2.2/20100803/logs-2000-tomcat/
 
[INFO] Running TestSuite
[INFO] Tests run: 118, Failures: 1, Errors: 0, Skipped: 117, Time elapsed: 23.135 sec <<<
FAILURE!
[INFO] Running TestSuite
[INFO] Tests run: 38, Failures: 1, Errors: 0, Skipped: 37, Time elapsed: 21.574 sec <<<
FAILURE!
--
[INFO] Running TestSuite
[INFO] Tests run: 3, Failures: 1, Errors: 0, Skipped: 2, Time elapsed: 21.124 sec <<<
FAILURE!
[INFO] Running TestSuite
[INFO] Tests run: 4, Failures: 1, Errors: 0, Skipped: 3, Time elapsed: 21.164 sec <<<
FAILURE!
[INFO] Running TestSuite
[INFO] Tests run: 4, Failures: 1, Errors: 0, Skipped: 3, Time elapsed: 21.113 sec <<<
FAILURE!
 
[INFO] [INFO] Could not find manifest file: /home/geronimo/geronimo/2.2/testsuite/deployment-testsuite/jca-cms-tests/jca-cms-ear/src/main/application/META-INF/MANIFEST.MF
- Generating one
[INFO] [INFO] Building jar: /home/geronimo/geronimo/2.2/testsuite/deployment-testsuite/jca-cms-tests/jca-cms-ear/target/jca-cms-ear-2.2.2-SNAPSHOT.ear
[INFO] [INFO] [selenium:start-server {execution: start}]
[INFO] Created dir: /home/geronimo/geronimo/2.2/testsuite/deployment-testsuite/jca-cms-tests/jca-cms-ear/target/selenium
[INFO] Launching Selenium Server
[INFO] Waiting for Selenium Server...
[INFO] [WARNING] OS appears to be Unix and no DISPLAY environment variable has been detected.
Browser maybe unable to function correctly. Consider using the selenium:xvfb goal to enable
headless operation.
[INFO] [INFO] Redirecting output to: /home/geronimo/geronimo/2.2/testsuite/deployment-testsuite/jca-cms-tests/jca-cms-ear/target/selenium/server.log
[INFO] [INFO] User extensions: /home/geronimo/geronimo/2.2/testsuite/deployment-testsuite/jca-cms-tests/jca-cms-ear/target/selenium/user-extensions.js
[INFO] Selenium Server started
[INFO] [INFO] [geronimo:deploy-module {execution: deploy-ears}]
[INFO] [INFO] Using non-artifact based module archive: /home/geronimo/geronimo/2.2/testsuite/deployment-testsuite/jca-cms-tests/jca-cms-ear/target/jca-cms-ear-2.2.2-SNAPSHOT.ear
[INFO] [INFO] Distributing module artifact: /home/geronimo/geronimo/2.2/testsuite/deployment-testsuite/jca-cms-tests/jca-cms-ear/target/jca-cms-ear-2.2.2-SNAPSHOT.ear
[INFO] [INFO] Starting modules...
[INFO] [INFO] Starting module: org.apache.geronimo.testsuite/jca-cms-ear/2.2.2-SNAPSHOT/ear
[INFO] [INFO] Started module(s):
[INFO] [INFO]     [0] org.apache.geronimo.testsuite/jca-cms-ear/2.2.2-SNAPSHOT/ear
[INFO] [INFO] [failsafe:integration-test {execution: integration-test}]
[INFO] [INFO] Failsafe report directory: /home/geronimo/geronimo/2.2/testsuite/deployment-testsuite/jca-cms-tests/jca-cms-ear/target/failsafe-reports
[INFO] 
[INFO] -------------------------------------------------------
[INFO]  T E S T S
[INFO] -------------------------------------------------------
[INFO] Running TestSuite
[INFO] Tests run: 4, Failures: 1, Errors: 0, Skipped: 3, Time elapsed: 21.113 sec <<<
FAILURE!
[INFO] 
[INFO] Results :
[INFO] 
[INFO] Failed tests: 
[INFO]   startSeleniumClient(org.apache.geronimo.testsuite.jcacms.CmsTest)
[INFO] 
[INFO] Tests run: 4, Failures: 1, Errors: 0, Skipped: 3
[INFO] 
[INFO] [WARNING] File encoding has not been set, using platform encoding ANSI_X3.4-1968, i.e.
build is platform dependent!
[INFO] [INFO] [selenium:stop-server {execution: stop}]
[INFO] Stopping Selenium server...
[INFO] Stop request sent
[INFO] [INFO] [geronimo:undeploy-module {execution: undeploy-ear-as-module}]
[INFO] [INFO] Using non-artifact based module id: org.apache.geronimo.testsuite/jca-cms-ear/2.2.2-SNAPSHOT/ear
[INFO] [INFO] Stopping module: org.apache.geronimo.testsuite/jca-cms-ear/2.2.2-SNAPSHOT/ear
[INFO] [INFO] Stopped module(s):
[INFO] [INFO]     [0] org.apache.geronimo.testsuite/jca-cms-ear/2.2.2-SNAPSHOT/ear
[INFO] [INFO]         [0] web.war; URL: /jca-cms
[INFO] [INFO]         [1] tranql.rar
[INFO] [INFO] Undeploying module: org.apache.geronimo.testsuite/jca-cms-ear/2.2.2-SNAPSHOT/ear
[INFO] [INFO] Undeployed module(s):
[INFO] [INFO]     [0] org.apache.geronimo.testsuite/jca-cms-ear/2.2.2-SNAPSHOT/ear
[INFO] [INFO] [failsafe:verify {execution: verify}]
[INFO] [INFO] Failsafe report directory: /home/geronimo/geronimo/2.2/testsuite/deployment-testsuite/jca-cms-tests/jca-cms-ear/target/failsafe-reports
[INFO] [WARNING] File encoding has not been set, using platform encoding ANSI_X3.4-1968, i.e.
build is platform dependent!
[INFO] [ERROR] There are test failures.
[INFO] 
[INFO] Please refer to /home/geronimo/geronimo/2.2/testsuite/deployment-testsuite/jca-cms-tests/jca-cms-ear/target/failsafe-reports
for the individual test results.
[INFO] [INFO] [ianal:verify-legal-files {execution: default}]
[INFO] [WARNING] Skipping verification of legal files in artifacts:
[INFO] [WARNING]     org.apache.geronimo.testsuite:jca-cms-ear:ear:2.2.2-SNAPSHOT
[INFO] [INFO] [install:install]
[INFO] [INFO] Installing /home/geronimo/geronimo/2.2/testsuite/deployment-testsuite/jca-cms-tests/jca-cms-ear/target/jca-cms-ear-2.2.2-SNAPSHOT.ear
to /home/geronimo/.m2/repository/org/apache/geronimo/testsuite/jca-cms-ear/2.2.2-SNAPSHOT/jca-cms-ear-2.2.2-SNAPSHOT.ear
[INFO] [INFO] 
[INFO] [INFO] 
[INFO] [INFO] ------------------------------------------------------------------------
[INFO] [INFO] Reactor Summary:
[INFO] [INFO] ------------------------------------------------------------------------
[INFO] [INFO] Geronimo TestSuite :: Deployment Testsuite :: J2CA Container Managed Security
Test  SUCCESS [9.081s]
[INFO] [INFO] Geronimo TestSuite :: Deployment Testsuite :: J2CA Container Managed Security
WAR  SUCCESS [5.072s]
[INFO] [INFO] Geronimo TestSuite :: Deployment Testsuite :: J2CA Container Managed Security
EAR  SUCCESS [43.289s]
[INFO] [INFO] ------------------------------------------------------------------------
[INFO] [INFO] ------------------------------------------------------------------------
[INFO] [INFO] BUILD SUCCESSFUL
[INFO] [INFO] ------------------------------------------------------------------------
[INFO] [INFO] Total time: 1 minute 4 seconds
[INFO] [INFO] Finished at: Tue Aug 03 03:31:22 EDT 2010
[INFO] [INFO] Final Memory: 53M/567M
[INFO] [INFO] ------------------------------------------------------------------------
[INFO] [ianal:verify-legal-files {execution: default}]
[INFO] [install:install]
[INFO] Installing /home/geronimo/geronimo/2.2/testsuite/deployment-testsuite/pom.xml to /home/geronimo/.m2/repository/org/apache/geronimo/testsuite/deployment-testsuite/2.2.2-SNAPSHOT/deployment-testsuite-2.2.2-SNAPSHOT.pom
[INFO] [geronimo:stop-server {execution: stop}]
[INFO] Stopping Geronimo server...
[INFO] ------------------------------------------------------------------------
[INFO] Building Geronimo TestSuite :: Enterprise Testsuite
[INFO]    task-segment: [install]
[INFO] ------------------------------------------------------------------------
[INFO] [genesis:validate-configuration {execution: default}]
[INFO] [enforcer:enforce {execution: default}]
[INFO] [remote-resources:process {execution: default}]
[INFO] [site:attach-descriptor]
[INFO] [install:install {execution: install-ahead}]
[INFO] Installing /home/geronimo/geronimo/2.2/testsuite/enterprise-testsuite/pom.xml to /home/geronimo/.m2/repository/org/apache/geronimo/testsuite/enterprise-testsuite/2.2.2-SNAPSHOT/enterprise-testsuite-2.2.2-SNAPSHOT.pom
[INFO] [geronimo:start-server {execution: start}]
[INFO] Using assembly configuration: tomcat
[INFO] Using assembly artifact: org.apache.geronimo.assemblies:geronimo-tomcat6-javaee5:zip:bin:2.2.2-SNAPSHOT:provided
[INFO] Using geronimoHome: /home/geronimo/geronimo/2.2/testsuite/enterprise-testsuite/target/geronimo-tomcat6-javaee5-2.2.2-SNAPSHOT
[INFO] Installing assembly...
[INFO] Expanding: /home/geronimo/.m2/repository/org/apache/geronimo/assemblies/geronimo-tomcat6-javaee5/2.2.2-SNAPSHOT/geronimo-tomcat6-javaee5-2.2.2-SNAPSHOT-bin.zip
into /home/geronimo/geronimo/2.2/testsuite/enterprise-testsuite/target
[INFO] Starting Geronimo server...
[INFO] Selected option set: default
[INFO] Redirecting output to: /home/geronimo/geronimo/2.2/testsuite/enterprise-testsuite/target/geronimo-logs/org.apache.geronimo.mavenplugins.geronimo.server.StartServerMojo.log
[INFO] Waiting for Geronimo server...
[INFO] ------------------------------------------------------------------------
[ERROR] BUILD ERROR
 
Assembly: jetty
=================================
See full test results and logs at http://people.apache.org/builds/geronimo/server/binaries/2.2/20100803/logs-2000-jetty/
 
[INFO] Running TestSuite
[INFO] Tests run: 118, Failures: 1, Errors: 0, Skipped: 117, Time elapsed: 22.683 sec <<<
FAILURE!
[INFO] Running TestSuite
[INFO] Tests run: 38, Failures: 1, Errors: 0, Skipped: 37, Time elapsed: 21.53 sec <<<
FAILURE!
--
[INFO] Running TestSuite
[INFO] Tests run: 3, Failures: 1, Errors: 0, Skipped: 2, Time elapsed: 21.151 sec <<<
FAILURE!
[INFO] Running TestSuite
[INFO] Tests run: 4, Failures: 1, Errors: 0, Skipped: 3, Time elapsed: 21.199 sec <<<
FAILURE!
[INFO] Running TestSuite
[INFO] Tests run: 4, Failures: 1, Errors: 0, Skipped: 3, Time elapsed: 21.069 sec <<<
FAILURE!
[INFO] Running TestSuite
[INFO] Tests run: 9, Failures: 1, Errors: 0, Skipped: 8, Time elapsed: 21.286 sec <<<
FAILURE!
--
[INFO] Running TestSuite
[INFO] Tests run: 3, Failures: 1, Errors: 0, Skipped: 2, Time elapsed: 21.133 sec <<<
FAILURE!
--
[INFO] Running TestSuite
[INFO] Tests run: 11, Failures: 1, Errors: 0, Skipped: 10, Time elapsed: 21.231 sec <<<
FAILURE!
[INFO] Running TestSuite
[INFO] Tests run: 38, Failures: 1, Errors: 0, Skipped: 37, Time elapsed: 21.479 sec <<<
FAILURE!
[INFO] Running TestSuite
[INFO] Tests run: 6, Failures: 1, Errors: 0, Skipped: 5, Time elapsed: 21.211 sec <<<
FAILURE!
[INFO] Running TestSuite
[INFO] Tests run: 3, Failures: 1, Errors: 0, Skipped: 2, Time elapsed: 21.028 sec <<<
FAILURE!
[INFO] Running TestSuite
[INFO] Tests run: 3, Failures: 1, Errors: 0, Skipped: 2, Time elapsed: 21.079 sec <<<
FAILURE!
[INFO] Running TestSuite
[INFO] Tests run: 3, Failures: 1, Errors: 0, Skipped: 2, Time elapsed: 21.05 sec <<<
FAILURE!
[INFO] Running TestSuite
[INFO] Tests run: 5, Failures: 1, Errors: 0, Skipped: 4, Time elapsed: 21.197 sec <<<
FAILURE!
 
Samples: branches/2.2
=================================
Log: http://people.apache.org/builds/geronimo/server/binaries/2.2/20100803/samples-2000.log
 
Build status: FAILED
 

Mime
View raw message