geronimo-dev mailing list archives

Site index · List index
Message view « Date » · « Thread »
Top « Date » · « Thread »
From ga...@apache.org
Subject [BUILD] branches/2.2: Failed for Revision: 980996
Date Sat, 31 Jul 2010 08:48:20 GMT
Geronimo Revision: 980996 built with tests included
 
See the full build-2000.log file at http://people.apache.org/builds/geronimo/server/binaries/2.2/20100731/build-2000.log
 
Download the binaries from http://people.apache.org/builds/geronimo/server/binaries/2.2/20100731
[INFO] BUILD SUCCESSFUL
[INFO] ------------------------------------------------------------------------
[INFO] Total time: 399 minutes 6 seconds
[INFO] Finished at: Sat Jul 31 02:45:59 EDT 2010
[INFO] Final Memory: 328M/910M
[INFO] ------------------------------------------------------------------------
 
TESTSUITE RESULTS (Failures only)
=================================
 
Assembly: tomcat
=================================
See full test results and logs at http://people.apache.org/builds/geronimo/server/binaries/2.2/20100731/logs-2000-tomcat/
 
[INFO] Running TestSuite
[INFO] Tests run: 118, Failures: 1, Errors: 0, Skipped: 117, Time elapsed: 23.424 sec <<<
FAILURE!
[INFO] Running TestSuite
[INFO] Tests run: 38, Failures: 1, Errors: 0, Skipped: 37, Time elapsed: 21.553 sec <<<
FAILURE!
--
[INFO] Running TestSuite
[INFO] Tests run: 3, Failures: 1, Errors: 0, Skipped: 2, Time elapsed: 21.061 sec <<<
FAILURE!
[INFO] Running TestSuite
[INFO] Tests run: 4, Failures: 1, Errors: 0, Skipped: 3, Time elapsed: 21.073 sec <<<
FAILURE!
[INFO] Running TestSuite
[INFO] Tests run: 4, Failures: 1, Errors: 0, Skipped: 3, Time elapsed: 21.026 sec <<<
FAILURE!
[INFO] Running TestSuite
[INFO] Tests run: 9, Failures: 1, Errors: 0, Skipped: 8, Time elapsed: 21.164 sec <<<
FAILURE!
--
[INFO] Running TestSuite
[INFO] Tests run: 3, Failures: 1, Errors: 0, Skipped: 2, Time elapsed: 21.071 sec <<<
FAILURE!
--
[INFO] Running TestSuite
[INFO] Tests run: 11, Failures: 1, Errors: 0, Skipped: 10, Time elapsed: 21.137 sec <<<
FAILURE!
[INFO] Running TestSuite
[INFO] Tests run: 38, Failures: 1, Errors: 0, Skipped: 37, Time elapsed: 21.503 sec <<<
FAILURE!
[INFO] Running TestSuite
[INFO] Tests run: 6, Failures: 1, Errors: 0, Skipped: 5, Time elapsed: 21.176 sec <<<
FAILURE!
[INFO] Running TestSuite
[INFO] Tests run: 3, Failures: 1, Errors: 0, Skipped: 2, Time elapsed: 21.028 sec <<<
FAILURE!
[INFO] Running TestSuite
[INFO] Tests run: 3, Failures: 1, Errors: 0, Skipped: 2, Time elapsed: 21.178 sec <<<
FAILURE!
--
[INFO] Running TestSuite
[INFO] Tests run: 3, Failures: 1, Errors: 0, Skipped: 2, Time elapsed: 21.074 sec <<<
FAILURE!
[INFO] Running TestSuite
[INFO] Tests run: 5, Failures: 1, Errors: 0, Skipped: 4, Time elapsed: 21.129 sec <<<
FAILURE!
 
Assembly: jetty
=================================
See full test results and logs at http://people.apache.org/builds/geronimo/server/binaries/2.2/20100731/logs-2000-jetty/
 
[INFO] Running TestSuite
[INFO] Tests run: 118, Failures: 1, Errors: 0, Skipped: 117, Time elapsed: 22.45 sec <<<
FAILURE!
[INFO] Running TestSuite
[INFO] Tests run: 38, Failures: 1, Errors: 0, Skipped: 37, Time elapsed: 21.5 sec <<<
FAILURE!
--
[INFO] Running TestSuite
[INFO] Tests run: 3, Failures: 1, Errors: 0, Skipped: 2, Time elapsed: 21.051 sec <<<
FAILURE!
[INFO] Running TestSuite
[INFO] Tests run: 4, Failures: 1, Errors: 0, Skipped: 3, Time elapsed: 21.14 sec <<<
FAILURE!
[INFO] Running TestSuite
[INFO] Tests run: 4, Failures: 1, Errors: 0, Skipped: 3, Time elapsed: 21.043 sec <<<
FAILURE!
[INFO] Running TestSuite
[INFO] Tests run: 9, Failures: 1, Errors: 0, Skipped: 8, Time elapsed: 21.182 sec <<<
FAILURE!
--
[INFO] Running TestSuite
[INFO] Tests run: 3, Failures: 1, Errors: 0, Skipped: 2, Time elapsed: 21.042 sec <<<
FAILURE!
--
[INFO] Running TestSuite
[INFO] Tests run: 11, Failures: 1, Errors: 0, Skipped: 10, Time elapsed: 21.16 sec <<<
FAILURE!
[INFO] Running TestSuite
[INFO] Tests run: 38, Failures: 1, Errors: 0, Skipped: 37, Time elapsed: 21.517 sec <<<
FAILURE!
[INFO] Running TestSuite
[INFO] Tests run: 6, Failures: 1, Errors: 0, Skipped: 5, Time elapsed: 21.169 sec <<<
FAILURE!
[INFO] Running TestSuite
[INFO] Tests run: 3, Failures: 1, Errors: 0, Skipped: 2, Time elapsed: 21.024 sec <<<
FAILURE!
[INFO] Running TestSuite
[INFO] Tests run: 3, Failures: 1, Errors: 0, Skipped: 2, Time elapsed: 21.166 sec <<<
FAILURE!
[INFO] Running TestSuite
[INFO] Tests run: 3, Failures: 1, Errors: 0, Skipped: 2, Time elapsed: 21.073 sec <<<
FAILURE!
[INFO] Running TestSuite
[INFO] Tests run: 5, Failures: 1, Errors: 0, Skipped: 4, Time elapsed: 21.365 sec <<<
FAILURE!
 
Samples: branches/2.2
=================================
Log: http://people.apache.org/builds/geronimo/server/binaries/2.2/20100731/samples-2000.log
 
Build status: FAILED
 

Mime
View raw message