geronimo-dev mailing list archives

Site index · List index
Message view « Date » · « Thread »
Top « Date » · « Thread »
From ga...@apache.org
Subject [BUILD] branches/2.2: Failed for Revision: 979916
Date Wed, 28 Jul 2010 08:52:16 GMT
Geronimo Revision: 979916 built with tests included
 
See the full build-2000.log file at http://people.apache.org/builds/geronimo/server/binaries/2.2/20100728/build-2000.log
 
Download the binaries from http://people.apache.org/builds/geronimo/server/binaries/2.2/20100728
[INFO] BUILD SUCCESSFUL
[INFO] ------------------------------------------------------------------------
[INFO] Total time: 394 minutes 30 seconds
[INFO] Finished at: Wed Jul 28 02:41:55 EDT 2010
[INFO] Final Memory: 325M/849M
[INFO] ------------------------------------------------------------------------
 
TESTSUITE RESULTS (Failures only)
=================================
 
Assembly: tomcat
=================================
See full test results and logs at http://people.apache.org/builds/geronimo/server/binaries/2.2/20100728/logs-2000-tomcat/
 
[INFO] Running TestSuite
[INFO] Tests run: 118, Failures: 1, Errors: 0, Skipped: 117, Time elapsed: 23.222 sec <<<
FAILURE!
[INFO] Running TestSuite
[INFO] Tests run: 38, Failures: 1, Errors: 0, Skipped: 37, Time elapsed: 21.543 sec <<<
FAILURE!
--
[INFO] Running TestSuite
[INFO] Tests run: 3, Failures: 1, Errors: 0, Skipped: 2, Time elapsed: 21.08 sec <<<
FAILURE!
[INFO] Running TestSuite
[INFO] Tests run: 4, Failures: 1, Errors: 0, Skipped: 3, Time elapsed: 21.139 sec <<<
FAILURE!
[INFO] Running TestSuite
[INFO] Tests run: 4, Failures: 1, Errors: 0, Skipped: 3, Time elapsed: 21.471 sec <<<
FAILURE!
[INFO] Running TestSuite
[INFO] Tests run: 9, Failures: 1, Errors: 0, Skipped: 8, Time elapsed: 21.179 sec <<<
FAILURE!
--
[INFO] Running TestSuite
[INFO] Tests run: 3, Failures: 1, Errors: 0, Skipped: 2, Time elapsed: 21.027 sec <<<
FAILURE!
--
[INFO] Running TestSuite
[INFO] Tests run: 11, Failures: 1, Errors: 0, Skipped: 10, Time elapsed: 21.215 sec <<<
FAILURE!
[INFO] Running TestSuite
[INFO] Tests run: 38, Failures: 1, Errors: 0, Skipped: 37, Time elapsed: 21.611 sec <<<
FAILURE!
[INFO] Running TestSuite
[INFO] Tests run: 6, Failures: 1, Errors: 0, Skipped: 5, Time elapsed: 21.17 sec <<<
FAILURE!
[INFO] Running TestSuite
[INFO] Tests run: 3, Failures: 1, Errors: 0, Skipped: 2, Time elapsed: 21.088 sec <<<
FAILURE!
[INFO] Running TestSuite
[INFO] Tests run: 3, Failures: 1, Errors: 0, Skipped: 2, Time elapsed: 21.094 sec <<<
FAILURE!
--
[INFO] Running TestSuite
[INFO] Tests run: 3, Failures: 1, Errors: 0, Skipped: 2, Time elapsed: 21.192 sec <<<
FAILURE!
[INFO] Running TestSuite
[INFO] Tests run: 5, Failures: 1, Errors: 0, Skipped: 4, Time elapsed: 21.065 sec <<<
FAILURE!
 
Assembly: jetty
=================================
See full test results and logs at http://people.apache.org/builds/geronimo/server/binaries/2.2/20100728/logs-2000-jetty/
 
[INFO] Running TestSuite
[INFO] Tests run: 118, Failures: 1, Errors: 0, Skipped: 117, Time elapsed: 22.934 sec <<<
FAILURE!
[INFO] Running TestSuite
[INFO] Tests run: 38, Failures: 1, Errors: 0, Skipped: 37, Time elapsed: 21.458 sec <<<
FAILURE!
--
[INFO] Running TestSuite
[INFO] Tests run: 3, Failures: 1, Errors: 0, Skipped: 2, Time elapsed: 21.135 sec <<<
FAILURE!
[INFO] Running TestSuite
[INFO] Tests run: 4, Failures: 1, Errors: 0, Skipped: 3, Time elapsed: 21.141 sec <<<
FAILURE!
[INFO] Running TestSuite
[INFO] Tests run: 4, Failures: 1, Errors: 0, Skipped: 3, Time elapsed: 21.042 sec <<<
FAILURE!
[INFO] Running TestSuite
[INFO] Tests run: 9, Failures: 1, Errors: 0, Skipped: 8, Time elapsed: 21.169 sec <<<
FAILURE!
--
[INFO] Running TestSuite
[INFO] Tests run: 3, Failures: 1, Errors: 0, Skipped: 2, Time elapsed: 21.053 sec <<<
FAILURE!
--
[INFO] Running TestSuite
[INFO] Tests run: 11, Failures: 1, Errors: 0, Skipped: 10, Time elapsed: 21.172 sec <<<
FAILURE!
[INFO] Running TestSuite
[INFO] Tests run: 38, Failures: 1, Errors: 0, Skipped: 37, Time elapsed: 21.601 sec <<<
FAILURE!
[INFO] Running TestSuite
[INFO] Tests run: 6, Failures: 1, Errors: 0, Skipped: 5, Time elapsed: 21.224 sec <<<
FAILURE!
[INFO] Running TestSuite
[INFO] Tests run: 3, Failures: 1, Errors: 0, Skipped: 2, Time elapsed: 21.054 sec <<<
FAILURE!
[INFO] Running TestSuite
[INFO] Tests run: 3, Failures: 1, Errors: 0, Skipped: 2, Time elapsed: 21.02 sec <<<
FAILURE!
[INFO] Running TestSuite
[INFO] Tests run: 3, Failures: 1, Errors: 0, Skipped: 2, Time elapsed: 21.137 sec <<<
FAILURE!
[INFO] Running TestSuite
[INFO] Tests run: 5, Failures: 1, Errors: 0, Skipped: 4, Time elapsed: 21.392 sec <<<
FAILURE!
 
Samples: branches/2.2
=================================
Log: http://people.apache.org/builds/geronimo/server/binaries/2.2/20100728/samples-2000.log
 
Build status: FAILED
 

Mime
View raw message