geronimo-dev mailing list archives

Site index · List index
Message view « Date » · « Thread »
Top « Date » · « Thread »
From ga...@apache.org
Subject [BUILD] branches/2.2: Failed for Revision: 979487
Date Tue, 27 Jul 2010 14:35:21 GMT
Geronimo Revision: 979487 built with tests included
 
See the full build-2000.log file at http://people.apache.org/builds/geronimo/server/binaries/2.2/20100726/build-2000.log
 
Download the binaries from http://people.apache.org/builds/geronimo/server/binaries/2.2/20100726
[INFO] BUILD SUCCESSFUL
[INFO] ------------------------------------------------------------------------
[INFO] Total time: 31 minutes 50 seconds
[INFO] Finished at: Mon Jul 26 20:39:33 EDT 2010
[INFO] Final Memory: 325M/924M
[INFO] ------------------------------------------------------------------------
 
TESTSUITE RESULTS (Failures only)
=================================
 
Assembly: tomcat
=================================
See full test results and logs at http://people.apache.org/builds/geronimo/server/binaries/2.2/20100726/logs-2000-tomcat/
 
[INFO] Running TestSuite
[INFO] Tests run: 118, Failures: 1, Errors: 0, Skipped: 117, Time elapsed: 23.653 sec <<<
FAILURE!
[INFO] Running TestSuite
[INFO] Tests run: 38, Failures: 1, Errors: 0, Skipped: 37, Time elapsed: 21.452 sec <<<
FAILURE!
--
[INFO] Running TestSuite
[INFO] Tests run: 3, Failures: 1, Errors: 0, Skipped: 2, Time elapsed: 21.108 sec <<<
FAILURE!
[INFO] Running TestSuite
[INFO] Tests run: 4, Failures: 1, Errors: 0, Skipped: 3, Time elapsed: 21.288 sec <<<
FAILURE!
[INFO] Running TestSuite
[INFO] Tests run: 4, Failures: 1, Errors: 0, Skipped: 3, Time elapsed: 21.063 sec <<<
FAILURE!
[INFO] Running TestSuite
[INFO] Tests run: 9, Failures: 1, Errors: 0, Skipped: 8, Time elapsed: 21.145 sec <<<
FAILURE!
--
[INFO] Running TestSuite
[INFO] Tests run: 3, Failures: 1, Errors: 0, Skipped: 2, Time elapsed: 21.014 sec <<<
FAILURE!
--
[INFO] Running TestSuite
[INFO] Tests run: 11, Failures: 1, Errors: 0, Skipped: 10, Time elapsed: 21.211 sec <<<
FAILURE!
[INFO] Running TestSuite
[INFO] Tests run: 38, Failures: 1, Errors: 0, Skipped: 37, Time elapsed: 21.52 sec <<<
FAILURE!
[INFO] Running TestSuite
[INFO] Tests run: 6, Failures: 1, Errors: 0, Skipped: 5, Time elapsed: 21.146 sec <<<
FAILURE!
[INFO] Running TestSuite
[INFO] Tests run: 3, Failures: 1, Errors: 0, Skipped: 2, Time elapsed: 21.119 sec <<<
FAILURE!
[INFO] Running TestSuite
[INFO] Tests run: 3, Failures: 1, Errors: 0, Skipped: 2, Time elapsed: 21.047 sec <<<
FAILURE!
--
[INFO] Running TestSuite
[INFO] Tests run: 3, Failures: 1, Errors: 0, Skipped: 2, Time elapsed: 21.064 sec <<<
FAILURE!
[INFO] Running TestSuite
[INFO] Tests run: 5, Failures: 1, Errors: 0, Skipped: 4, Time elapsed: 21.116 sec <<<
FAILURE!
 
Assembly: jetty
=================================
See full test results and logs at http://people.apache.org/builds/geronimo/server/binaries/2.2/20100726/logs-2000-jetty/
 
 
Samples: branches/2.2
=================================
Log: http://people.apache.org/builds/geronimo/server/binaries/2.2/20100726/samples-2000.log
 
Build status: FAILED
 

Mime
View raw message