geronimo-dev mailing list archives

Site index · List index
Message view « Date » · « Thread »
Top « Date » · « Thread »
From ga...@apache.org
Subject [BUILD] trunk: Failed for Revision: 979560
Date Tue, 27 Jul 2010 09:31:30 GMT
Geronimo Revision: 979560 built with tests included
 
See the full build-0300.log file at http://people.apache.org/builds/geronimo/server/binaries/trunk/20100727/build-0300.log
 
Download the binaries from http://people.apache.org/builds/geronimo/server/binaries/trunk/20100727
[INFO] BUILD SUCCESSFUL
[INFO] ------------------------------------------------------------------------
[INFO] Total time: 23 minutes 13 seconds
[INFO] Finished at: Tue Jul 27 04:07:33 EDT 2010
[INFO] Final Memory: 511M/1001M
[INFO] ------------------------------------------------------------------------
 
TESTSUITE RESULTS (Failures only)
=================================
 
Assembly: tomcat
=================================
See full test results and logs at http://people.apache.org/builds/geronimo/server/binaries/trunk/20100727/logs-0300-tomcat/
 
Running TestSuite
Tests run: 1, Failures: 1, Errors: 0, Skipped: 0, Time elapsed: 0.429 sec <<< FAILURE!
--
Running TestSuite
Tests run: 22, Failures: 14, Errors: 0, Skipped: 0, Time elapsed: 29.185 sec <<<
FAILURE!
Running TestSuite
Tests run: 4, Failures: 4, Errors: 0, Skipped: 0, Time elapsed: 0.497 sec <<< FAILURE!
--
Running TestSuite
Tests run: 1, Failures: 1, Errors: 0, Skipped: 0, Time elapsed: 0.417 sec <<< FAILURE!
 
Assembly: jetty
=================================
See full test results and logs at http://people.apache.org/builds/geronimo/server/binaries/trunk/20100727/logs-0300-jetty/
 
Running TestSuite
Tests run: 1, Failures: 1, Errors: 0, Skipped: 0, Time elapsed: 0.48 sec <<< FAILURE!
--
Running TestSuite
Tests run: 22, Failures: 14, Errors: 0, Skipped: 0, Time elapsed: 28.519 sec <<<
FAILURE!
Running TestSuite
Tests run: 4, Failures: 4, Errors: 0, Skipped: 0, Time elapsed: 0.513 sec <<< FAILURE!
--
Running TestSuite
Tests run: 1, Failures: 1, Errors: 0, Skipped: 0, Time elapsed: 0.442 sec <<< FAILURE!
 
Samples: trunk
=================================
Log: http://people.apache.org/builds/geronimo/server/binaries/trunk/20100727/samples-0300.log
 
Build status: FAILED
 

Mime
View raw message