geronimo-dev mailing list archives

Site index · List index
Message view « Date » · « Thread »
Top « Date » · « Thread »
From ga...@apache.org
Subject [BUILD] trunk: Failed for Revision: 979490
Date Tue, 27 Jul 2010 03:01:40 GMT
Geronimo Revision: 979490 built with tests included
 
See the full build-2100.log file at http://people.apache.org/builds/geronimo/server/binaries/trunk/20100726/build-2100.log
 
Download the binaries from http://people.apache.org/builds/geronimo/server/binaries/trunk/20100726
[INFO] BUILD SUCCESSFUL
[INFO] ------------------------------------------------------------------------
[INFO] Total time: 37 minutes 39 seconds
[INFO] Finished at: Mon Jul 26 21:42:34 EDT 2010
[INFO] Final Memory: 458M/1014M
[INFO] ------------------------------------------------------------------------
 
TESTSUITE RESULTS (Failures only)
=================================
 
Assembly: tomcat
=================================
See full test results and logs at http://people.apache.org/builds/geronimo/server/binaries/trunk/20100726/logs-2100-tomcat/
 
Running TestSuite
Tests run: 1, Failures: 1, Errors: 0, Skipped: 0, Time elapsed: 0.471 sec <<< FAILURE!
--
Running TestSuite
Tests run: 1, Failures: 1, Errors: 0, Skipped: 0, Time elapsed: 7.014 sec <<< FAILURE!
--
Running TestSuite
Tests run: 22, Failures: 14, Errors: 0, Skipped: 0, Time elapsed: 26.383 sec <<<
FAILURE!
Running TestSuite
Tests run: 4, Failures: 4, Errors: 0, Skipped: 0, Time elapsed: 0.495 sec <<< FAILURE!
--
Running TestSuite
Tests run: 1, Failures: 1, Errors: 0, Skipped: 0, Time elapsed: 0.418 sec <<< FAILURE!
 
Assembly: jetty
=================================
See full test results and logs at http://people.apache.org/builds/geronimo/server/binaries/trunk/20100726/logs-2100-jetty/
 
Running TestSuite
Tests run: 1, Failures: 1, Errors: 0, Skipped: 0, Time elapsed: 0.745 sec <<< FAILURE!
--
Running TestSuite
Tests run: 1, Failures: 1, Errors: 0, Skipped: 0, Time elapsed: 6.696 sec <<< FAILURE!
--
Running TestSuite
Tests run: 22, Failures: 14, Errors: 0, Skipped: 0, Time elapsed: 28.553 sec <<<
FAILURE!
Running TestSuite
Tests run: 4, Failures: 4, Errors: 0, Skipped: 0, Time elapsed: 0.546 sec <<< FAILURE!
--
Running TestSuite
Tests run: 1, Failures: 1, Errors: 0, Skipped: 0, Time elapsed: 0.421 sec <<< FAILURE!
 
Samples: trunk
=================================
Log: http://people.apache.org/builds/geronimo/server/binaries/trunk/20100726/samples-2100.log
 
Build status: FAILED
 

Mime
View raw message