geronimo-dev mailing list archives

Site index · List index
Message view « Date » · « Thread »
Top « Date » · « Thread »
From ga...@apache.org
Subject [BUILD] branches/2.2: Failed for Revision: 979387
Date Mon, 26 Jul 2010 20:56:49 GMT
Geronimo Revision: 979387 built with tests included
 
See the full build-1400.log file at http://people.apache.org/builds/geronimo/server/binaries/2.2/20100726/build-1400.log
 
Download the binaries from http://people.apache.org/builds/geronimo/server/binaries/2.2/20100726
[INFO] BUILD SUCCESSFUL
[INFO] ------------------------------------------------------------------------
[INFO] Total time: 51 minutes 16 seconds
[INFO] Finished at: Mon Jul 26 14:57:22 EDT 2010
[INFO] Final Memory: 334M/969M
[INFO] ------------------------------------------------------------------------
 
TESTSUITE RESULTS (Failures only)
=================================
 
Assembly: tomcat
=================================
See full test results and logs at http://people.apache.org/builds/geronimo/server/binaries/2.2/20100726/logs-1400-tomcat/
 
[INFO] Running TestSuite
[INFO] Tests run: 118, Failures: 1, Errors: 0, Skipped: 117, Time elapsed: 23.358 sec <<<
FAILURE!
[INFO] Running TestSuite
[INFO] Tests run: 38, Failures: 1, Errors: 0, Skipped: 37, Time elapsed: 21.63 sec <<<
FAILURE!
--
[INFO] Running TestSuite
[INFO] Tests run: 3, Failures: 1, Errors: 0, Skipped: 2, Time elapsed: 21.077 sec <<<
FAILURE!
[INFO] Running TestSuite
[INFO] Tests run: 4, Failures: 1, Errors: 0, Skipped: 3, Time elapsed: 21.151 sec <<<
FAILURE!
[INFO] Running TestSuite
[INFO] Tests run: 4, Failures: 1, Errors: 0, Skipped: 3, Time elapsed: 21.038 sec <<<
FAILURE!
[INFO] Running TestSuite
[INFO] Tests run: 9, Failures: 1, Errors: 0, Skipped: 8, Time elapsed: 21.336 sec <<<
FAILURE!
--
[INFO] Running TestSuite
[INFO] Tests run: 3, Failures: 1, Errors: 0, Skipped: 2, Time elapsed: 21.048 sec <<<
FAILURE!
--
[INFO] Running TestSuite
[INFO] Tests run: 11, Failures: 1, Errors: 0, Skipped: 10, Time elapsed: 21.269 sec <<<
FAILURE!
[INFO] Running TestSuite
[INFO] Tests run: 38, Failures: 1, Errors: 0, Skipped: 37, Time elapsed: 21.672 sec <<<
FAILURE!
[INFO] Running TestSuite
[INFO] Tests run: 6, Failures: 1, Errors: 0, Skipped: 5, Time elapsed: 21.332 sec <<<
FAILURE!
[INFO] Running TestSuite
[INFO] Tests run: 3, Failures: 1, Errors: 0, Skipped: 2, Time elapsed: 21.161 sec <<<
FAILURE!
[INFO] Running TestSuite
[INFO] Tests run: 3, Failures: 1, Errors: 0, Skipped: 2, Time elapsed: 21.113 sec <<<
FAILURE!
--
[INFO] Running TestSuite
[INFO] Tests run: 3, Failures: 1, Errors: 0, Skipped: 2, Time elapsed: 21.028 sec <<<
FAILURE!
[INFO] Running TestSuite
[INFO] Tests run: 5, Failures: 1, Errors: 0, Skipped: 4, Time elapsed: 21.042 sec <<<
FAILURE!
 
Assembly: jetty
=================================
See full test results and logs at http://people.apache.org/builds/geronimo/server/binaries/2.2/20100726/logs-1400-jetty/
 
[INFO] Running TestSuite
[INFO] Tests run: 118, Failures: 1, Errors: 0, Skipped: 117, Time elapsed: 22.378 sec <<<
FAILURE!
[INFO] Running TestSuite
[INFO] Tests run: 38, Failures: 1, Errors: 0, Skipped: 37, Time elapsed: 21.458 sec <<<
FAILURE!
--
[INFO] Running TestSuite
[INFO] Tests run: 3, Failures: 1, Errors: 0, Skipped: 2, Time elapsed: 21.05 sec <<<
FAILURE!
[INFO] Running TestSuite
[INFO] Tests run: 4, Failures: 1, Errors: 0, Skipped: 3, Time elapsed: 21.098 sec <<<
FAILURE!
[INFO] Running TestSuite
[INFO] Tests run: 4, Failures: 1, Errors: 0, Skipped: 3, Time elapsed: 21.046 sec <<<
FAILURE!
[INFO] Running TestSuite
[INFO] Tests run: 9, Failures: 1, Errors: 0, Skipped: 8, Time elapsed: 21.197 sec <<<
FAILURE!
--
[INFO] Running TestSuite
[INFO] Tests run: 3, Failures: 1, Errors: 0, Skipped: 2, Time elapsed: 21.028 sec <<<
FAILURE!
--
[INFO] Running TestSuite
[INFO] Tests run: 11, Failures: 1, Errors: 0, Skipped: 10, Time elapsed: 21.257 sec <<<
FAILURE!
[INFO] Running TestSuite
[INFO] Tests run: 38, Failures: 1, Errors: 0, Skipped: 37, Time elapsed: 21.694 sec <<<
FAILURE!
[INFO] Running TestSuite
[INFO] Tests run: 6, Failures: 1, Errors: 0, Skipped: 5, Time elapsed: 21.936 sec <<<
FAILURE!
[INFO] Running TestSuite
[INFO] Tests run: 3, Failures: 1, Errors: 0, Skipped: 2, Time elapsed: 21.048 sec <<<
FAILURE!
[INFO] Running TestSuite
[INFO] Tests run: 3, Failures: 1, Errors: 0, Skipped: 2, Time elapsed: 21.039 sec <<<
FAILURE!
[INFO] Running TestSuite
[INFO] Tests run: 3, Failures: 1, Errors: 0, Skipped: 2, Time elapsed: 21.096 sec <<<
FAILURE!
[INFO] Running TestSuite
[INFO] Tests run: 5, Failures: 1, Errors: 0, Skipped: 4, Time elapsed: 21.04 sec <<<
FAILURE!
 
Samples: branches/2.2
=================================
Log: http://people.apache.org/builds/geronimo/server/binaries/2.2/20100726/samples-1400.log
 
Build status: FAILED
 

Mime
View raw message