geronimo-dev mailing list archives

Site index · List index
Message view « Date » · « Thread »
Top « Date » · « Thread »
From ga...@apache.org
Subject [BUILD] trunk: Failed for Revision: 979411
Date Mon, 26 Jul 2010 20:56:48 GMT
Geronimo Revision: 979411 built with tests included
 
See the full build-1500.log file at http://people.apache.org/builds/geronimo/server/binaries/trunk/20100726/build-1500.log
 
Download the binaries from http://people.apache.org/builds/geronimo/server/binaries/trunk/20100726
[INFO] BUILD SUCCESSFUL
[INFO] ------------------------------------------------------------------------
[INFO] Total time: 39 minutes 34 seconds
[INFO] Finished at: Mon Jul 26 15:40:36 EDT 2010
[INFO] Final Memory: 451M/1013M
[INFO] ------------------------------------------------------------------------
 
TESTSUITE RESULTS (Failures only)
=================================
 
Assembly: tomcat
=================================
See full test results and logs at http://people.apache.org/builds/geronimo/server/binaries/trunk/20100726/logs-1500-tomcat/
 
Running TestSuite
Tests run: 1, Failures: 1, Errors: 0, Skipped: 0, Time elapsed: 0.472 sec <<< FAILURE!
--
Running TestSuite
Tests run: 1, Failures: 1, Errors: 0, Skipped: 0, Time elapsed: 0.918 sec <<< FAILURE!
--
Running TestSuite
Tests run: 22, Failures: 9, Errors: 0, Skipped: 0, Time elapsed: 57.77 sec <<< FAILURE!
Running TestSuite
Tests run: 4, Failures: 4, Errors: 0, Skipped: 0, Time elapsed: 0.621 sec <<< FAILURE!
--
Running TestSuite
Tests run: 1, Failures: 1, Errors: 0, Skipped: 0, Time elapsed: 0.43 sec <<< FAILURE!
--
Running TestSuite
Tests run: 1, Failures: 1, Errors: 0, Skipped: 0, Time elapsed: 60.924 sec <<< FAILURE!
 
Assembly: jetty
=================================
See full test results and logs at http://people.apache.org/builds/geronimo/server/binaries/trunk/20100726/logs-1500-jetty/
 
Running TestSuite
Tests run: 1, Failures: 1, Errors: 0, Skipped: 0, Time elapsed: 0.472 sec <<< FAILURE!
--
Running TestSuite
Tests run: 1, Failures: 1, Errors: 0, Skipped: 0, Time elapsed: 0.94 sec <<< FAILURE!
--
Running TestSuite
Tests run: 22, Failures: 7, Errors: 0, Skipped: 0, Time elapsed: 29.311 sec <<< FAILURE!
Running TestSuite
Tests run: 4, Failures: 4, Errors: 0, Skipped: 0, Time elapsed: 0.521 sec <<< FAILURE!
--
Running TestSuite
Tests run: 1, Failures: 1, Errors: 0, Skipped: 0, Time elapsed: 0.441 sec <<< FAILURE!
--
Running TestSuite
Tests run: 1, Failures: 1, Errors: 0, Skipped: 0, Time elapsed: 61.204 sec <<< FAILURE!
 
Samples: trunk
=================================
Log: http://people.apache.org/builds/geronimo/server/binaries/trunk/20100726/samples-1500.log
 
Build status: FAILED
 

Mime
View raw message