geronimo-dev mailing list archives

Site index · List index
Message view « Date » · « Thread »
Top « Date » · « Thread »
From ga...@apache.org
Subject [BUILD] branches/2.1: Failed for Revision: 966092
Date Wed, 21 Jul 2010 07:23:46 GMT
Geronimo Revision: 966092 built with tests included
 
See the full build-0200.log file at http://people.apache.org/builds/geronimo/server/binaries/2.1/20100721/build-0200.log
 
Download the binaries from http://people.apache.org/builds/geronimo/server/binaries/2.1/20100721
[INFO] BUILD SUCCESSFUL
[INFO] ------------------------------------------------------------------------
[INFO] Total time: 27 minutes 50 seconds
[INFO] Finished at: Wed Jul 21 02:32:44 EDT 2010
[INFO] Final Memory: 304M/996M
[INFO] ------------------------------------------------------------------------
 
TESTSUITE RESULTS (Failures only)
=================================
 
Assembly: tomcat
=================================
See full test results and logs at http://people.apache.org/builds/geronimo/server/binaries/2.1/20100721/logs-0200-tomcat/
 
[INFO] Running commands-testsuite.gshell
[INFO] Tests run: 4, Failures: 3, Errors: 0, Skipped: 0, Time elapsed: 0.754 sec <<<
FAILURE!
--
[INFO] Running security-testsuite.security
[INFO] Tests run: 36, Failures: 1, Errors: 0, Skipped: 0, Time elapsed: 59.749 sec <<<
FAILURE!
 
Assembly: jetty
=================================
See full test results and logs at http://people.apache.org/builds/geronimo/server/binaries/2.1/20100721/logs-0200-jetty/
 
[INFO] Running commands-testsuite.gshell
[INFO] Tests run: 4, Failures: 3, Errors: 0, Skipped: 0, Time elapsed: 0.739 sec <<<
FAILURE!
 
Samples: branches/2.1
=================================
Log: http://people.apache.org/builds/geronimo/server/binaries/2.1/20100721/samples-0200.log
 
Build status: FAILED
 

Mime
View raw message