geronimo-dev mailing list archives

Site index · List index
Message view « Date » · « Thread »
Top « Date » · « Thread »
From ga...@apache.org
Subject [BUILD] trunk: Failed for Revision: 964542
Date Thu, 15 Jul 2010 19:43:14 GMT
Geronimo Revision: 964542 built with tests included
 
See the full build-1500.log file at http://people.apache.org/builds/geronimo/server/binaries/trunk/20100715/build-1500.log
 
 
See the unit test reports at http://people.apache.org/builds/geronimo/server/binaries/trunk/20100715/unit-test-reports
 
Downloading: file:///home/geronimo/.m2/jtidy.repository/org/eclipse/jetty/jetty-ajp/8.0.0.M1/jetty-ajp-8.0.0.M1.jar
[INFO] Unable to find resource 'org.eclipse.jetty:jetty-ajp:jar:8.0.0.M1' in repository local
(file:///home/geronimo/.m2/jtidy.repository)
Downloading: http://oss.sonatype.org/content/repositories/jetty//org/eclipse/jetty/jetty-ajp/8.0.0.M1/jetty-ajp-8.0.0.M1.jar
31K downloaded  (jetty-ajp-8.0.0.M1.jar)
Downloading: file:///home/geronimo/.m2/jtidy.repository/org/eclipse/jetty/jetty-server/8.0.0.M1/jetty-server-8.0.0.M1.jar
[INFO] Unable to find resource 'org.eclipse.jetty:jetty-server:jar:8.0.0.M1' in repository
local (file:///home/geronimo/.m2/jtidy.repository)
Downloading: http://oss.sonatype.org/content/repositories/jetty//org/eclipse/jetty/jetty-server/8.0.0.M1/jetty-server-8.0.0.M1.jar
277K downloaded  (jetty-server-8.0.0.M1.jar)
Downloading: file:///home/geronimo/.m2/jtidy.repository/org/eclipse/jetty/jetty-continuation/8.0.0.M1/jetty-continuation-8.0.0.M1.jar
[INFO] Unable to find resource 'org.eclipse.jetty:jetty-continuation:jar:8.0.0.M1' in repository
local (file:///home/geronimo/.m2/jtidy.repository)
Downloading: http://oss.sonatype.org/content/repositories/jetty//org/eclipse/jetty/jetty-continuation/8.0.0.M1/jetty-continuation-8.0.0.M1.jar
20K downloaded  (jetty-continuation-8.0.0.M1.jar)
Downloading: file:///home/geronimo/.m2/jtidy.repository/org/eclipse/jetty/jetty-http/8.0.0.M1/jetty-http-8.0.0.M1.jar
[INFO] Unable to find resource 'org.eclipse.jetty:jetty-http:jar:8.0.0.M1' in repository local
(file:///home/geronimo/.m2/jtidy.repository)
Downloading: http://oss.sonatype.org/content/repositories/jetty//org/eclipse/jetty/jetty-http/8.0.0.M1/jetty-http-8.0.0.M1.jar
100K downloaded  (jetty-http-8.0.0.M1.jar)
Downloading: file:///home/geronimo/.m2/jtidy.repository/org/eclipse/jetty/jetty-io/8.0.0.M1/jetty-io-8.0.0.M1.jar
[INFO] Unable to find resource 'org.eclipse.jetty:jetty-io:jar:8.0.0.M1' in repository local
(file:///home/geronimo/.m2/jtidy.repository)
Downloading: http://oss.sonatype.org/content/repositories/jetty//org/eclipse/jetty/jetty-io/8.0.0.M1/jetty-io-8.0.0.M1.jar
79K downloaded  (jetty-io-8.0.0.M1.jar)
Downloading: file:///home/geronimo/.m2/jtidy.repository/org/eclipse/jetty/jetty-jaspi/8.0.0.M1/jetty-jaspi-8.0.0.M1.jar
[INFO] Unable to find resource 'org.eclipse.jetty:jetty-jaspi:jar:8.0.0.M1' in repository
local (file:///home/geronimo/.m2/jtidy.repository)
Downloading: http://oss.sonatype.org/content/repositories/jetty//org/eclipse/jetty/jetty-jaspi/8.0.0.M1/jetty-jaspi-8.0.0.M1.jar
35K downloaded  (jetty-jaspi-8.0.0.M1.jar)
Downloading: file:///home/geronimo/.m2/jtidy.repository/org/eclipse/jetty/jetty-security/8.0.0.M1/jetty-security-8.0.0.M1.jar
[INFO] Unable to find resource 'org.eclipse.jetty:jetty-security:jar:8.0.0.M1' in repository
local (file:///home/geronimo/.m2/jtidy.repository)
Downloading: http://oss.sonatype.org/content/repositories/jetty//org/eclipse/jetty/jetty-security/8.0.0.M1/jetty-security-8.0.0.M1.jar
67K downloaded  (jetty-security-8.0.0.M1.jar)
Downloading: file:///home/geronimo/.m2/jtidy.repository/org/eclipse/jetty/jetty-webapp/8.0.0.M1/jetty-webapp-8.0.0.M1.jar
[INFO] Unable to find resource 'org.eclipse.jetty:jetty-webapp:jar:8.0.0.M1' in repository
local (file:///home/geronimo/.m2/jtidy.repository)
Downloading: http://oss.sonatype.org/content/repositories/jetty//org/eclipse/jetty/jetty-webapp/8.0.0.M1/jetty-webapp-8.0.0.M1.jar
91K downloaded  (jetty-webapp-8.0.0.M1.jar)
Downloading: file:///home/geronimo/.m2/jtidy.repository/org/eclipse/jetty/jetty-xml/8.0.0.M1/jetty-xml-8.0.0.M1.jar
[INFO] Unable to find resource 'org.eclipse.jetty:jetty-xml:jar:8.0.0.M1' in repository local
(file:///home/geronimo/.m2/jtidy.repository)
Downloading: http://oss.sonatype.org/content/repositories/jetty//org/eclipse/jetty/jetty-xml/8.0.0.M1/jetty-xml-8.0.0.M1.jar
28K downloaded  (jetty-xml-8.0.0.M1.jar)
Downloading: file:///home/geronimo/.m2/jtidy.repository/org/eclipse/jetty/jetty-servlet/8.0.0.M1/jetty-servlet-8.0.0.M1.jar
[INFO] Unable to find resource 'org.eclipse.jetty:jetty-servlet:jar:8.0.0.M1' in repository
local (file:///home/geronimo/.m2/jtidy.repository)
Downloading: http://oss.sonatype.org/content/repositories/jetty//org/eclipse/jetty/jetty-servlet/8.0.0.M1/jetty-servlet-8.0.0.M1.jar
79K downloaded  (jetty-servlet-8.0.0.M1.jar)
[INFO] [enforcer:enforce {execution: default}]
[INFO] [remote-resources:process {execution: default}]
[INFO] [resources:resources {execution: default-resources}]
[INFO] Using 'UTF-8' encoding to copy filtered resources.
[INFO] Copying 1 resource
[INFO] skip non existing resourceDirectory /home/geronimo/geronimo/trunk/plugins/jetty8/geronimo-jetty8/src/main/filtered-resources
[INFO] Copying 3 resources
[INFO] [compiler:compile {execution: default-compile}]
[INFO] Compiling 53 source files to /home/geronimo/geronimo/trunk/plugins/jetty8/geronimo-jetty8/target/classes
[INFO] ------------------------------------------------------------------------
[ERROR] BUILD FAILURE
[INFO] ------------------------------------------------------------------------
[INFO] Compilation failure
/home/geronimo/geronimo/trunk/plugins/jetty8/geronimo-jetty8/src/main/java/org/apache/geronimo/jetty8/WebAppContextWrapper.java:[229,21]
cannot find symbol
symbol  : method setInitParams(java.util.Map<java.lang.String,java.lang.String>)
location: class org.apache.geronimo.jetty8.handler.GeronimoWebAppContext


[INFO] ------------------------------------------------------------------------
[INFO] Trace
org.apache.maven.BuildFailureException: Compilation failure
/home/geronimo/geronimo/trunk/plugins/jetty8/geronimo-jetty8/src/main/java/org/apache/geronimo/jetty8/WebAppContextWrapper.java:[229,21]
cannot find symbol
symbol  : method setInitParams(java.util.Map<java.lang.String,java.lang.String>)
location: class org.apache.geronimo.jetty8.handler.GeronimoWebAppContext


	at org.apache.maven.lifecycle.DefaultLifecycleExecutor.executeGoals(DefaultLifecycleExecutor.java:715)
	at org.apache.maven.lifecycle.DefaultLifecycleExecutor.executeGoalWithLifecycle(DefaultLifecycleExecutor.java:556)
	at org.apache.maven.lifecycle.DefaultLifecycleExecutor.executeGoal(DefaultLifecycleExecutor.java:535)
	at org.apache.maven.lifecycle.DefaultLifecycleExecutor.executeGoalAndHandleFailures(DefaultLifecycleExecutor.java:387)
	at org.apache.maven.lifecycle.DefaultLifecycleExecutor.executeTaskSegments(DefaultLifecycleExecutor.java:348)
	at org.apache.maven.lifecycle.DefaultLifecycleExecutor.execute(DefaultLifecycleExecutor.java:180)
	at org.apache.maven.DefaultMaven.doExecute(DefaultMaven.java:328)
	at org.apache.maven.DefaultMaven.execute(DefaultMaven.java:138)
	at org.apache.maven.cli.MavenCli.main(MavenCli.java:362)
	at org.apache.maven.cli.compat.CompatibleMain.main(CompatibleMain.java:60)
	at sun.reflect.NativeMethodAccessorImpl.invoke0(Native Method)
	at sun.reflect.NativeMethodAccessorImpl.invoke(NativeMethodAccessorImpl.java:39)
	at sun.reflect.DelegatingMethodAccessorImpl.invoke(DelegatingMethodAccessorImpl.java:25)
	at java.lang.reflect.Method.invoke(Method.java:597)
	at org.codehaus.classworlds.Launcher.launchEnhanced(Launcher.java:315)
	at org.codehaus.classworlds.Launcher.launch(Launcher.java:255)
	at org.codehaus.classworlds.Launcher.mainWithExitCode(Launcher.java:430)
	at org.codehaus.classworlds.Launcher.main(Launcher.java:375)
Caused by: org.apache.maven.plugin.CompilationFailureException: Compilation failure
/home/geronimo/geronimo/trunk/plugins/jetty8/geronimo-jetty8/src/main/java/org/apache/geronimo/jetty8/WebAppContextWrapper.java:[229,21]
cannot find symbol
symbol  : method setInitParams(java.util.Map<java.lang.String,java.lang.String>)
location: class org.apache.geronimo.jetty8.handler.GeronimoWebAppContext


	at org.apache.maven.plugin.AbstractCompilerMojo.execute(AbstractCompilerMojo.java:516)
	at org.apache.maven.plugin.CompilerMojo.execute(CompilerMojo.java:114)
	at org.apache.maven.plugin.DefaultPluginManager.executeMojo(DefaultPluginManager.java:490)
	at org.apache.maven.lifecycle.DefaultLifecycleExecutor.executeGoals(DefaultLifecycleExecutor.java:694)
	... 17 more
[INFO] ------------------------------------------------------------------------
[INFO] Total time: 28 minutes 17 seconds
[INFO] Finished at: Thu Jul 15 15:29:33 EDT 2010
[INFO] Final Memory: 370M/997M
[INFO] ------------------------------------------------------------------------

Mime
View raw message