geronimo-dev mailing list archives

Site index · List index
Message view « Date » · « Thread »
Top « Date » · « Thread »
From David Jencks <david_jen...@yahoo.com>
Subject Re: [BUILD] trunk: Failed for Revision: 958089
Date Fri, 25 Jun 2010 20:16:59 GMT
for once a problem I didn't create :-)

should be fixed in rev 958100.

thanks
david jencks

On Jun 25, 2010, at 12:51 PM, gawor@apache.org wrote:

> Geronimo Revision: 958089 built with tests included
> 
> See the full build-1500.log file at http://people.apache.org/builds/geronimo/server/binaries/trunk/20100625/build-1500.log
> 
> 
> See the unit test reports at http://people.apache.org/builds/geronimo/server/binaries/trunk/20100625/unit-test-reports
> \<snip>

> [INFO] [compiler:testCompile {execution: default-testCompile}]
> [INFO] Compiling 4 source files to /home/geronimo/geronimo/trunk/plugins/openejb/geronimo-openejb-clustering-wadi/target/test-classes
> [INFO] ------------------------------------------------------------------------
> [ERROR] BUILD FAILURE
> [INFO] ------------------------------------------------------------------------
> [INFO] Compilation failure
> 
> /home/geronimo/geronimo/trunk/plugins/openejb/geronimo-openejb-clustering-wadi/src/test/java/org/apache/geronimo/openejb/cluster/stateful/container/ClusteredStatefulContainerTest.java:[67,48]
cannot find symbol
> symbol  : constructor DeploymentContext(java.lang.String,<nulltype>,<nulltype>)
> location: class org.apache.openejb.core.DeploymentContext
> 
> /home/geronimo/geronimo/trunk/plugins/openejb/geronimo-openejb-clustering-wadi/src/test/java/org/apache/geronimo/openejb/cluster/stateful/container/WadiCacheTest.java:[71,48]
cannot find symbol
> symbol  : constructor DeploymentContext(java.lang.String,<nulltype>,<nulltype>)
> location: class org.apache.openejb.core.DeploymentContext
> 
> 
> [INFO] ------------------------------------------------------------------------
> [INFO] Trace
> org.apache.maven.BuildFailureException: Compilation failure
> 	at org.apache.maven.lifecycle.DefaultLifecycleExecutor.executeGoals(DefaultLifecycleExecutor.java:715)
> 	at org.apache.maven.lifecycle.DefaultLifecycleExecutor.executeGoalWithLifecycle(DefaultLifecycleExecutor.java:556)
> 	at org.apache.maven.lifecycle.DefaultLifecycleExecutor.executeGoal(DefaultLifecycleExecutor.java:535)
> 	at org.apache.maven.lifecycle.DefaultLifecycleExecutor.executeGoalAndHandleFailures(DefaultLifecycleExecutor.java:387)
> 	at org.apache.maven.lifecycle.DefaultLifecycleExecutor.executeTaskSegments(DefaultLifecycleExecutor.java:348)
> 	at org.apache.maven.lifecycle.DefaultLifecycleExecutor.execute(DefaultLifecycleExecutor.java:180)
> 	at org.apache.maven.DefaultMaven.doExecute(DefaultMaven.java:328)
> 	at org.apache.maven.DefaultMaven.execute(DefaultMaven.java:138)
> 	at org.apache.maven.cli.MavenCli.main(MavenCli.java:362)
> 	at org.apache.maven.cli.compat.CompatibleMain.main(CompatibleMain.java:60)
> 	at sun.reflect.NativeMethodAccessorImpl.invoke0(Native Method)
> 	at sun.reflect.NativeMethodAccessorImpl.invoke(NativeMethodAccessorImpl.java:39)
> 	at sun.reflect.DelegatingMethodAccessorImpl.invoke(DelegatingMethodAccessorImpl.java:25)
> 	at java.lang.reflect.Method.invoke(Method.java:597)
> 	at org.codehaus.classworlds.Launcher.launchEnhanced(Launcher.java:315)
> 	at org.codehaus.classworlds.Launcher.launch(Launcher.java:255)
> 	at org.codehaus.classworlds.Launcher.mainWithExitCode(Launcher.java:430)
> 	at org.codehaus.classworlds.Launcher.main(Launcher.java:375)
> Caused by: org.apache.maven.plugin.CompilationFailureException: Compilation failure
> 	at org.apache.maven.plugin.AbstractCompilerMojo.execute(AbstractCompilerMojo.java:516)
> 	at org.apache.maven.plugin.TestCompilerMojo.execute(TestCompilerMojo.java:102)
> 	at org.apache.maven.plugin.DefaultPluginManager.executeMojo(DefaultPluginManager.java:490)
> 	at org.apache.maven.lifecycle.DefaultLifecycleExecutor.executeGoals(DefaultLifecycleExecutor.java:694)
> 	... 17 more
> [INFO] ------------------------------------------------------------------------
> [INFO] Total time: 22 minutes 14 seconds
> [INFO] Finished at: Fri Jun 25 15:38:42 EDT 2010
> [INFO] Final Memory: 484M/973M
> [INFO] ------------------------------------------------------------------------


Mime
View raw message