geronimo-dev mailing list archives

Site index · List index
Message view « Date » · « Thread »
Top « Date » · « Thread »
From ga...@apache.org
Subject [BUILD] trunk: Failed for Revision: 958162
Date Sat, 26 Jun 2010 01:43:50 GMT
Geronimo Revision: 958162 built with tests included
 
See the full build-2100.log file at http://people.apache.org/builds/geronimo/server/binaries/trunk/20100625/build-2100.log
 
 
See the unit test reports at http://people.apache.org/builds/geronimo/server/binaries/trunk/20100625/unit-test-reports
 
[INFO] Installing /home/geronimo/geronimo/trunk/plugins/myfaces/myfaces-deployer/target/resources/META-INF/geronimo-plugin.xml
to /home/geronimo/.m2/repository/org/apache/geronimo/configs/myfaces-deployer/3.0-SNAPSHOT/myfaces-deployer-3.0-SNAPSHOT.plugin-metadata
[INFO] [car:update-pluginlist {execution: default-update-pluginlist}]
[INFO] ------------------------------------------------------------------------
[INFO] Building Geronimo Plugins, OpenEJB :: Clustering over WADI
[INFO]    task-segment: [install]
[INFO] ------------------------------------------------------------------------
[INFO] [genesis:validate-configuration {execution: default}]
[INFO] [geronimo-property:set-property {execution: set-property}]
[INFO] [enforcer:enforce {execution: default}]
[INFO] [remote-resources:process {execution: default}]
[WARNING] org.apache.velocity.runtime.exception.ReferenceException: reference : template =
META-INF/DEPENDENCIES.vm [line 40,column 14] : $license.name is not a valid reference.
[WARNING] org.apache.velocity.runtime.exception.ReferenceException: reference : template =
META-INF/DEPENDENCIES.vm [line 40,column 14] : $license.name is not a valid reference.
[INFO] [resources:resources {execution: default-resources}]
[INFO] Using 'UTF-8' encoding to copy filtered resources.
[INFO] Copying 1 resource
[INFO] skip non existing resourceDirectory /home/geronimo/geronimo/trunk/plugins/openejb/geronimo-openejb-clustering-wadi/src/main/filtered-resources
[INFO] Copying 3 resources
[INFO] [compiler:compile {execution: default-compile}]
[INFO] Compiling 9 source files to /home/geronimo/geronimo/trunk/plugins/openejb/geronimo-openejb-clustering-wadi/target/classes
[INFO] [resources:testResources {execution: default-testResources}]
[INFO] Using 'UTF-8' encoding to copy filtered resources.
[INFO] skip non existing resourceDirectory /home/geronimo/geronimo/trunk/plugins/openejb/geronimo-openejb-clustering-wadi/src/test/resources
[INFO] skip non existing resourceDirectory /home/geronimo/geronimo/trunk/plugins/openejb/geronimo-openejb-clustering-wadi/src/test/filtered-resources
[INFO] Copying 3 resources
[INFO] [compiler:testCompile {execution: default-testCompile}]
[INFO] Compiling 4 source files to /home/geronimo/geronimo/trunk/plugins/openejb/geronimo-openejb-clustering-wadi/target/test-classes
[INFO] ------------------------------------------------------------------------
[ERROR] BUILD FAILURE
[INFO] ------------------------------------------------------------------------
[INFO] Compilation failure

/home/geronimo/geronimo/trunk/plugins/openejb/geronimo-openejb-clustering-wadi/src/test/java/org/apache/geronimo/openejb/cluster/stateful/container/ClusteredStatefulContainerTest.java:[28,30]
cannot find symbol
symbol  : class BeanContext
location: package org.apache.openejb.core

/home/geronimo/geronimo/trunk/plugins/openejb/geronimo-openejb-clustering-wadi/src/test/java/org/apache/geronimo/openejb/cluster/stateful/container/WadiCacheTest.java:[39,30]
cannot find symbol
symbol  : class BeanContext
location: package org.apache.openejb.core

/home/geronimo/geronimo/trunk/plugins/openejb/geronimo-openejb-clustering-wadi/src/test/java/org/apache/geronimo/openejb/cluster/stateful/container/ClusteredStatefulContainerTest.java:[28,30]
cannot find symbol
symbol  : class BeanContext
location: package org.apache.openejb.core

/home/geronimo/geronimo/trunk/plugins/openejb/geronimo-openejb-clustering-wadi/src/test/java/org/apache/geronimo/openejb/cluster/stateful/container/WadiCacheTest.java:[39,30]
cannot find symbol
symbol  : class BeanContext
location: package org.apache.openejb.core

/home/geronimo/geronimo/trunk/plugins/openejb/geronimo-openejb-clustering-wadi/src/test/java/org/apache/geronimo/openejb/cluster/stateful/container/ClusteredStatefulContainerTest.java:[69,52]
cannot find symbol
symbol  : class BeanContext
location: class org.apache.geronimo.openejb.cluster.stateful.container.ClusteredStatefulContainerTest

/home/geronimo/geronimo/trunk/plugins/openejb/geronimo-openejb-clustering-wadi/src/test/java/org/apache/geronimo/openejb/cluster/stateful/container/ClusteredStatefulContainerTest.java:[69,25]
internal error; cannot instantiate org.apache.openejb.core.CoreDeploymentInfo.<init>
at org.apache.openejb.core.CoreDeploymentInfo to ()

/home/geronimo/geronimo/trunk/plugins/openejb/geronimo-openejb-clustering-wadi/src/test/java/org/apache/geronimo/openejb/cluster/stateful/container/ClusteredStatefulContainerTest.java:[79,18]
cannot find symbol
symbol  : constructor CoreDeploymentInfo()
location: class org.apache.openejb.core.CoreDeploymentInfo

/home/geronimo/geronimo/trunk/plugins/openejb/geronimo-openejb-clustering-wadi/src/test/java/org/apache/geronimo/openejb/cluster/stateful/container/WadiCacheTest.java:[74,52]
cannot find symbol
symbol  : class BeanContext
location: class org.apache.geronimo.openejb.cluster.stateful.container.WadiCacheTest

/home/geronimo/geronimo/trunk/plugins/openejb/geronimo-openejb-clustering-wadi/src/test/java/org/apache/geronimo/openejb/cluster/stateful/container/WadiCacheTest.java:[74,25]
internal error; cannot instantiate org.apache.openejb.core.CoreDeploymentInfo.<init>
at org.apache.openejb.core.CoreDeploymentInfo to ()

/home/geronimo/geronimo/trunk/plugins/openejb/geronimo-openejb-clustering-wadi/src/test/java/org/apache/geronimo/openejb/cluster/stateful/container/WadiCacheTest.java:[84,18]
cannot find symbol
symbol  : constructor CoreDeploymentInfo()
location: class org.apache.openejb.core.CoreDeploymentInfo


[INFO] ------------------------------------------------------------------------
[INFO] Trace
org.apache.maven.BuildFailureException: Compilation failure
	at org.apache.maven.lifecycle.DefaultLifecycleExecutor.executeGoals(DefaultLifecycleExecutor.java:715)
	at org.apache.maven.lifecycle.DefaultLifecycleExecutor.executeGoalWithLifecycle(DefaultLifecycleExecutor.java:556)
	at org.apache.maven.lifecycle.DefaultLifecycleExecutor.executeGoal(DefaultLifecycleExecutor.java:535)
	at org.apache.maven.lifecycle.DefaultLifecycleExecutor.executeGoalAndHandleFailures(DefaultLifecycleExecutor.java:387)
	at org.apache.maven.lifecycle.DefaultLifecycleExecutor.executeTaskSegments(DefaultLifecycleExecutor.java:348)
	at org.apache.maven.lifecycle.DefaultLifecycleExecutor.execute(DefaultLifecycleExecutor.java:180)
	at org.apache.maven.DefaultMaven.doExecute(DefaultMaven.java:328)
	at org.apache.maven.DefaultMaven.execute(DefaultMaven.java:138)
	at org.apache.maven.cli.MavenCli.main(MavenCli.java:362)
	at org.apache.maven.cli.compat.CompatibleMain.main(CompatibleMain.java:60)
	at sun.reflect.NativeMethodAccessorImpl.invoke0(Native Method)
	at sun.reflect.NativeMethodAccessorImpl.invoke(NativeMethodAccessorImpl.java:39)
	at sun.reflect.DelegatingMethodAccessorImpl.invoke(DelegatingMethodAccessorImpl.java:25)
	at java.lang.reflect.Method.invoke(Method.java:597)
	at org.codehaus.classworlds.Launcher.launchEnhanced(Launcher.java:315)
	at org.codehaus.classworlds.Launcher.launch(Launcher.java:255)
	at org.codehaus.classworlds.Launcher.mainWithExitCode(Launcher.java:430)
	at org.codehaus.classworlds.Launcher.main(Launcher.java:375)
Caused by: org.apache.maven.plugin.CompilationFailureException: Compilation failure
	at org.apache.maven.plugin.AbstractCompilerMojo.execute(AbstractCompilerMojo.java:516)
	at org.apache.maven.plugin.TestCompilerMojo.execute(TestCompilerMojo.java:102)
	at org.apache.maven.plugin.DefaultPluginManager.executeMojo(DefaultPluginManager.java:490)
	at org.apache.maven.lifecycle.DefaultLifecycleExecutor.executeGoals(DefaultLifecycleExecutor.java:694)
	... 17 more
[INFO] ------------------------------------------------------------------------
[INFO] Total time: 29 minutes 45 seconds
[INFO] Finished at: Fri Jun 25 21:31:02 EDT 2010
[INFO] Final Memory: 425M/993M
[INFO] ------------------------------------------------------------------------

Mime
View raw message