geronimo-dev mailing list archives

Site index · List index
Message view « Date » · « Thread »
Top « Date » · « Thread »
From ga...@apache.org
Subject [BUILD] branches/2.1: Failed for Revision: 953937
Date Sat, 12 Jun 2010 07:42:51 GMT
Geronimo Revision: 953937 built with tests included
 
See the full build-0200.log file at http://people.apache.org/builds/geronimo/server/binaries/2.1/20100612/build-0200.log
 
Download the binaries from http://people.apache.org/builds/geronimo/server/binaries/2.1/20100612
[INFO] BUILD SUCCESSFUL
[INFO] ------------------------------------------------------------------------
[INFO] Total time: 39 minutes 5 seconds
[INFO] Finished at: Sat Jun 12 02:45:18 EDT 2010
[INFO] Final Memory: 297M/996M
[INFO] ------------------------------------------------------------------------
 
TESTSUITE RESULTS (Failures only)
=================================
 
Assembly: tomcat
=================================
See full test results and logs at http://people.apache.org/builds/geronimo/server/binaries/2.1/20100612/logs-0200-tomcat/
 
[INFO] Running console-testsuite.basic-console
[INFO] Tests run: 38, Failures: 1, Errors: 0, Skipped: 0, Time elapsed: 97.499 sec <<<
FAILURE!
[INFO] Running console-testsuite.advance-test
[INFO] Tests run: 15, Failures: 1, Errors: 0, Skipped: 0, Time elapsed: 75.884 sec <<<
FAILURE!
--
[INFO] Running sec-testsuite.security
[INFO] Tests run: 2, Failures: 2, Errors: 0, Skipped: 0, Time elapsed: 0.231 sec <<<
FAILURE!
--
[INFO] Running security-testsuite.security
[INFO] Tests run: 36, Failures: 1, Errors: 0, Skipped: 0, Time elapsed: 29.675 sec <<<
FAILURE!
 
Assembly: jetty
=================================
See full test results and logs at http://people.apache.org/builds/geronimo/server/binaries/2.1/20100612/logs-0200-jetty/
 
[INFO] Running console-testsuite.basic-console
[INFO] Tests run: 38, Failures: 1, Errors: 0, Skipped: 0, Time elapsed: 99.288 sec <<<
FAILURE!
[INFO] Running console-testsuite.advance-test
[INFO] Tests run: 15, Failures: 1, Errors: 0, Skipped: 0, Time elapsed: 78.229 sec <<<
FAILURE!
--
[INFO] Running sec-testsuite.security
[INFO] Tests run: 2, Failures: 1, Errors: 0, Skipped: 0, Time elapsed: 3.228 sec <<<
FAILURE!
 
Samples: branches/2.1
=================================
Log: http://people.apache.org/builds/geronimo/server/binaries/2.1/20100612/samples-0200.log
 
Build status: FAILED
 

Mime
View raw message