geronimo-dev mailing list archives

Site index · List index
Message view « Date » · « Thread »
Top « Date » · « Thread »
From ga...@apache.org
Subject [BUILD] branches/2.1: Failed for Revision: 952107
Date Mon, 07 Jun 2010 07:35:09 GMT
Geronimo Revision: 952107 built with tests included
 
See the full build-0200.log file at http://people.apache.org/builds/geronimo/server/binaries/2.1/20100607/build-0200.log
 
Download the binaries from http://people.apache.org/builds/geronimo/server/binaries/2.1/20100607
[INFO] BUILD SUCCESSFUL
[INFO] ------------------------------------------------------------------------
[INFO] Total time: 29 minutes 2 seconds
[INFO] Finished at: Mon Jun 07 02:35:59 EDT 2010
[INFO] Final Memory: 303M/1016M
[INFO] ------------------------------------------------------------------------
 
TESTSUITE RESULTS (Failures only)
=================================
 
Assembly: tomcat
=================================
See full test results and logs at http://people.apache.org/builds/geronimo/server/binaries/2.1/20100607/logs-0200-tomcat/
 
[INFO] Running console-testsuite.basic-console
[INFO] Tests run: 38, Failures: 1, Errors: 0, Skipped: 0, Time elapsed: 94.742 sec <<<
FAILURE!
[INFO] Running console-testsuite.advance-test
[INFO] Tests run: 15, Failures: 1, Errors: 0, Skipped: 0, Time elapsed: 78.343 sec <<<
FAILURE!
--
[INFO] Running sec-testsuite.security
[INFO] Tests run: 2, Failures: 2, Errors: 0, Skipped: 0, Time elapsed: 0.27 sec <<<
FAILURE!
--
[INFO] Running security-testsuite.security
[INFO] Tests run: 36, Failures: 1, Errors: 0, Skipped: 0, Time elapsed: 31.716 sec <<<
FAILURE!
 
Assembly: jetty
=================================
See full test results and logs at http://people.apache.org/builds/geronimo/server/binaries/2.1/20100607/logs-0200-jetty/
 
[INFO] Running console-testsuite.basic-console
[INFO] Tests run: 38, Failures: 1, Errors: 0, Skipped: 0, Time elapsed: 99.641 sec <<<
FAILURE!
[INFO] Running console-testsuite.advance-test
[INFO] Tests run: 15, Failures: 1, Errors: 0, Skipped: 0, Time elapsed: 78.231 sec <<<
FAILURE!
--
[INFO] Running sec-testsuite.security
[INFO] Tests run: 2, Failures: 1, Errors: 0, Skipped: 0, Time elapsed: 3.231 sec <<<
FAILURE!
 
Samples: branches/2.1
=================================
Log: http://people.apache.org/builds/geronimo/server/binaries/2.1/20100607/samples-0200.log
 
Build status: FAILED
 

Mime
View raw message