geronimo-dev mailing list archives

Site index · List index
Message view « Date » · « Thread »
Top « Date » · « Thread »
From ga...@apache.org
Subject [BUILD] branches/2.2: Failed for Revision: 951376
Date Fri, 04 Jun 2010 11:51:49 GMT
Geronimo Revision: 951376 built with tests included
 
See the full build-0800.log file at http://people.apache.org/builds/geronimo/server/binaries/2.2/20100604/build-0800.log
 
 
See the unit test reports at http://people.apache.org/builds/geronimo/server/binaries/2.2/20100604/unit-test-reports
 
[INFO] [compiler:compile]
[INFO] Compiling 21 source files to /home/geronimo/geronimo/2.2/plugins/axis2/geronimo-axis2/target/classes
[WARNING] /home/geronimo/geronimo/2.2/plugins/axis2/geronimo-axis2/src/main/java/org/apache/geronimo/axis2/client/Axis2ClientConfigurationFactory.java:[26,35]
[deprecation] org.apache.axis2.jaxws.util.ClassLoaderUtils in org.apache.axis2.jaxws.util
has been deprecated

[WARNING] /home/geronimo/geronimo/2.2/plugins/axis2/geronimo-axis2/src/main/java/org/apache/geronimo/axis2/client/Axis2ClientConfigurationFactory.java:[45,25]
[deprecation] org.apache.axis2.jaxws.util.ClassLoaderUtils in org.apache.axis2.jaxws.util
has been deprecated

[WARNING] /home/geronimo/geronimo/2.2/plugins/axis2/geronimo-axis2/src/main/java/org/apache/geronimo/axis2/AxisServiceGenerator.java:[96,19]
[deprecation] getNameSpacesMap() in org.apache.axis2.description.AxisService has been deprecated

[WARNING] /home/geronimo/geronimo/2.2/plugins/axis2/geronimo-axis2/src/main/java/org/apache/geronimo/axis2/AxisServiceGenerator.java:[102,19]
[deprecation] setNameSpacesMap(org.apache.ws.commons.schema.utils.NamespaceMap) in org.apache.axis2.description.AxisService
has been deprecated

[INFO] [resources:testResources]
[INFO] Using 'UTF-8' encoding to copy filtered resources.
[INFO] Copying 6 resources
[INFO] skip non existing resourceDirectory /home/geronimo/geronimo/2.2/plugins/axis2/geronimo-axis2/src/test/filtered-resources
[INFO] Copying 3 resources
[INFO] [compiler:testCompile]
[INFO] Compiling 7 source files to /home/geronimo/geronimo/2.2/plugins/axis2/geronimo-axis2/target/test-classes
[INFO] [surefire:test]
[INFO] Surefire report directory: /home/geronimo/geronimo/2.2/plugins/axis2/geronimo-axis2/target/surefire-reports

-------------------------------------------------------
 T E S T S
-------------------------------------------------------
Running org.apache.geronimo.axis2.Axis2WebServiceContainerTest
Tests run: 3, Failures: 0, Errors: 0, Skipped: 0, Time elapsed: 3.502 sec

Results :

Tests run: 3, Failures: 0, Errors: 0, Skipped: 0

[INFO] [jar:jar]
[INFO] Building jar: /home/geronimo/geronimo/2.2/plugins/axis2/geronimo-axis2/target/geronimo-axis2-2.2.1-SNAPSHOT.jar
[INFO] [ianal:verify-legal-files {execution: default}]
[INFO] Checking legal files in: geronimo-axis2-2.2.1-SNAPSHOT.jar
[INFO] [install:install]
[INFO] Installing /home/geronimo/geronimo/2.2/plugins/axis2/geronimo-axis2/target/geronimo-axis2-2.2.1-SNAPSHOT.jar
to /home/geronimo/.m2/repository/org/apache/geronimo/modules/geronimo-axis2/2.2.1-SNAPSHOT/geronimo-axis2-2.2.1-SNAPSHOT.jar
[INFO] ------------------------------------------------------------------------
[INFO] Building Geronimo Plugins, AXIS2 :: AXIS2
[INFO]    task-segment: [install]
[INFO] ------------------------------------------------------------------------
[INFO] [genesis:validate-configuration {execution: default}]
Downloading: http://maven.rtp.raleigh.ibm.com/nexus-proxy//org/apache/axis2/addressing/1.5.1/addressing-1.5.1.pom
3K downloaded
Downloading: http://maven.rtp.raleigh.ibm.com/nexus-proxy//org/apache/axis2/addressing/1.5.1/addressing-1.5.1.mar
24K downloaded
[INFO] [enforcer:enforce {execution: default}]
[INFO] [remote-resources:process {execution: default}]
[INFO] [resources:resources]
[INFO] Using 'UTF-8' encoding to copy filtered resources.
[INFO] skip non existing resourceDirectory /home/geronimo/geronimo/2.2/plugins/axis2/axis2/src/main/resources
[INFO] skip non existing resourceDirectory /home/geronimo/geronimo/2.2/plugins/axis2/axis2/src/main/filtered-resources
[INFO] Copying 3 resources
[INFO] [car:validate-configuration]
[INFO] [car:prepare-plan]
[INFO] Generated: /home/geronimo/geronimo/2.2/plugins/axis2/axis2/target/work/plan.xml
[INFO] [car:verify-no-dependency-change]
[INFO] ------------------------------------------------------------------------
[ERROR] BUILD FAILURE
[INFO] ------------------------------------------------------------------------
[INFO] Dependencies have changed:
	Added dependencies are saved here: /home/geronimo/geronimo/2.2/plugins/axis2/axis2/src/main/history/dependencies.added.xml
	Tree listing is saved here: /home/geronimo/geronimo/2.2/plugins/axis2/axis2/src/main/history/treeListing.txt
Delete /home/geronimo/geronimo/2.2/plugins/axis2/axis2/src/main/history/dependencies.xml if
you are happy with the dependency changes.
[INFO] ------------------------------------------------------------------------
[INFO] Trace
org.apache.maven.BuildFailureException: Dependencies have changed:
	Added dependencies are saved here: /home/geronimo/geronimo/2.2/plugins/axis2/axis2/src/main/history/dependencies.added.xml
	Tree listing is saved here: /home/geronimo/geronimo/2.2/plugins/axis2/axis2/src/main/history/treeListing.txt
Delete /home/geronimo/geronimo/2.2/plugins/axis2/axis2/src/main/history/dependencies.xml if
you are happy with the dependency changes.
	at org.apache.maven.lifecycle.DefaultLifecycleExecutor.executeGoals(DefaultLifecycleExecutor.java:580)
	at org.apache.maven.lifecycle.DefaultLifecycleExecutor.executeGoalWithLifecycle(DefaultLifecycleExecutor.java:500)
	at org.apache.maven.lifecycle.DefaultLifecycleExecutor.executeGoal(DefaultLifecycleExecutor.java:479)
	at org.apache.maven.lifecycle.DefaultLifecycleExecutor.executeGoalAndHandleFailures(DefaultLifecycleExecutor.java:331)
	at org.apache.maven.lifecycle.DefaultLifecycleExecutor.executeTaskSegments(DefaultLifecycleExecutor.java:292)
	at org.apache.maven.lifecycle.DefaultLifecycleExecutor.execute(DefaultLifecycleExecutor.java:142)
	at org.apache.maven.DefaultMaven.doExecute(DefaultMaven.java:336)
	at org.apache.maven.DefaultMaven.execute(DefaultMaven.java:129)
	at org.apache.maven.cli.MavenCli.main(MavenCli.java:301)
	at sun.reflect.NativeMethodAccessorImpl.invoke0(Native Method)
	at sun.reflect.NativeMethodAccessorImpl.invoke(NativeMethodAccessorImpl.java:39)
	at sun.reflect.DelegatingMethodAccessorImpl.invoke(DelegatingMethodAccessorImpl.java:25)
	at java.lang.reflect.Method.invoke(Method.java:585)
	at org.codehaus.classworlds.Launcher.launchEnhanced(Launcher.java:315)
	at org.codehaus.classworlds.Launcher.launch(Launcher.java:255)
	at org.codehaus.classworlds.Launcher.mainWithExitCode(Launcher.java:430)
	at org.codehaus.classworlds.Launcher.main(Launcher.java:375)
Caused by: org.apache.maven.plugin.MojoFailureException: Dependencies have changed:
	Added dependencies are saved here: /home/geronimo/geronimo/2.2/plugins/axis2/axis2/src/main/history/dependencies.added.xml
	Tree listing is saved here: /home/geronimo/geronimo/2.2/plugins/axis2/axis2/src/main/history/treeListing.txt
Delete /home/geronimo/geronimo/2.2/plugins/axis2/axis2/src/main/history/dependencies.xml if
you are happy with the dependency changes.
	at org.apache.geronimo.mavenplugins.car.DependencyChangeMojo.saveDependencyChanges(DependencyChangeMojo.java:155)
	at org.apache.geronimo.mavenplugins.car.DependencyChangeMojo.execute(DependencyChangeMojo.java:114)
	at org.apache.maven.plugin.DefaultPluginManager.executeMojo(DefaultPluginManager.java:453)
	at org.apache.maven.lifecycle.DefaultLifecycleExecutor.executeGoals(DefaultLifecycleExecutor.java:559)
	... 16 more
[INFO] ------------------------------------------------------------------------
[INFO] Total time: 17 minutes 10 seconds
[INFO] Finished at: Fri Jun 04 08:21:53 EDT 2010
[INFO] Final Memory: 315M/914M
[INFO] ------------------------------------------------------------------------

Mime
View raw message