geronimo-dev mailing list archives

Site index · List index
Message view « Date » · « Thread »
Top « Date » · « Thread »
From ga...@apache.org
Subject [BUILD] trunk: Failed for Revision: 950890
Date Thu, 03 Jun 2010 07:29:59 GMT
Geronimo Revision: 950890 built with tests included
 
See the full build-0300.log file at http://people.apache.org/builds/geronimo/server/binaries/trunk/20100603/build-0300.log
 
 
See the unit test reports at http://people.apache.org/builds/geronimo/server/binaries/trunk/20100603/unit-test-reports
 
[INFO] OSGi bundle is resolved: org.apache.geronimo.modules.geronimo-openjpa2
[INFO] [ianal:verify-legal-files {execution: default}]
[INFO] Checking legal files in: geronimo-openjpa2-3.0-SNAPSHOT.jar
[INFO] [install:install {execution: default-install}]
[INFO] Installing /home/geronimo/geronimo/trunk/plugins/openjpa2/geronimo-openjpa2/target/geronimo-openjpa2-3.0-SNAPSHOT.jar
to /home/geronimo/.m2/repository/org/apache/geronimo/modules/geronimo-openjpa2/3.0-SNAPSHOT/geronimo-openjpa2-3.0-SNAPSHOT.jar
[INFO] [bundle:install {execution: default-install}]
[INFO] Parsing file:/home/geronimo/.m2/repository/repository.xml
[INFO] Installing org/apache/geronimo/modules/geronimo-openjpa2/3.0-SNAPSHOT/geronimo-openjpa2-3.0-SNAPSHOT.jar
[INFO] Writing OBR metadata
[INFO] ------------------------------------------------------------------------
[INFO] Building Geronimo Plugins, OpenJPA2 :: Aries JPA
[INFO]    task-segment: [install]
[INFO] ------------------------------------------------------------------------
[INFO] [genesis:validate-configuration {execution: default}]
[INFO] [geronimo-property:set-property {execution: set-property}]
[INFO] snapshot org.apache.aries.jpa:org.apache.aries.jpa.container:0.2-incubating-SNAPSHOT:
checking for updates from local
[INFO] snapshot org.apache.aries.jpa:org.apache.aries.jpa.container:0.2-incubating-SNAPSHOT:
checking for updates from jetty.oss.sonatype.org
[INFO] snapshot org.apache.aries.jpa:org.apache.aries.jpa.container:0.2-incubating-SNAPSHOT:
checking for updates from openqa-snapshots
[INFO] snapshot org.apache.aries.jpa:org.apache.aries.jpa.container:0.2-incubating-SNAPSHOT:
checking for updates from codehaus.snapshots
[INFO] snapshot org.apache.aries.jpa:org.apache.aries.jpa.container:0.2-incubating-SNAPSHOT:
checking for updates from apache.snapshots
Downloading: http://repository.apache.org/snapshots/org/apache/aries/jpa/org.apache.aries.jpa.container/0.2-incubating-SNAPSHOT/org.apache.aries.jpa.container-0.2-incubating-20100602.205147-3.pom
4K downloaded  (org.apache.aries.jpa.container-0.2-incubating-20100602.205147-3.pom)
[INFO] snapshot org.apache.aries.jpa:jpa:0.2-incubating-SNAPSHOT: checking for updates from
local
[INFO] snapshot org.apache.aries.jpa:jpa:0.2-incubating-SNAPSHOT: checking for updates from
jetty.oss.sonatype.org
[INFO] snapshot org.apache.aries.jpa:jpa:0.2-incubating-SNAPSHOT: checking for updates from
openqa-snapshots
[INFO] snapshot org.apache.aries.jpa:jpa:0.2-incubating-SNAPSHOT: checking for updates from
codehaus.snapshots
[INFO] snapshot org.apache.aries.jpa:jpa:0.2-incubating-SNAPSHOT: checking for updates from
apache.snapshots
Downloading: http://repository.apache.org/snapshots/org/apache/aries/jpa/jpa/0.2-incubating-SNAPSHOT/jpa-0.2-incubating-20100602.205147-3.pom
9K downloaded  (jpa-0.2-incubating-20100602.205147-3.pom)
[INFO] snapshot org.apache.aries.jpa:org.apache.aries.jpa.api:0.2-incubating-SNAPSHOT: checking
for updates from local
[INFO] snapshot org.apache.aries.jpa:org.apache.aries.jpa.api:0.2-incubating-SNAPSHOT: checking
for updates from jetty.oss.sonatype.org
[INFO] snapshot org.apache.aries.jpa:org.apache.aries.jpa.api:0.2-incubating-SNAPSHOT: checking
for updates from openqa-snapshots
[INFO] snapshot org.apache.aries.jpa:org.apache.aries.jpa.api:0.2-incubating-SNAPSHOT: checking
for updates from codehaus.snapshots
[INFO] snapshot org.apache.aries.jpa:org.apache.aries.jpa.api:0.2-incubating-SNAPSHOT: checking
for updates from apache.snapshots
Downloading: http://repository.apache.org/snapshots/org/apache/aries/jpa/org.apache.aries.jpa.api/0.2-incubating-SNAPSHOT/org.apache.aries.jpa.api-0.2-incubating-20100602.205147-3.pom
3K downloaded  (org.apache.aries.jpa.api-0.2-incubating-20100602.205147-3.pom)
Downloading: http://repository.apache.org/snapshots/org/apache/aries/jpa/org.apache.aries.jpa.container/0.2-incubating-SNAPSHOT/org.apache.aries.jpa.container-0.2-incubating-20100602.205147-3.jar
65K downloaded  (org.apache.aries.jpa.container-0.2-incubating-20100602.205147-3.jar)
Downloading: http://repository.apache.org/snapshots/org/apache/aries/jpa/org.apache.aries.jpa.api/0.2-incubating-SNAPSHOT/org.apache.aries.jpa.api-0.2-incubating-20100602.205147-3.jar
13K downloaded  (org.apache.aries.jpa.api-0.2-incubating-20100602.205147-3.jar)
[INFO] [enforcer:enforce {execution: default}]
[INFO] [remote-resources:process {execution: default}]
[INFO] [resources:resources {execution: default-resources}]
[INFO] Using 'UTF-8' encoding to copy filtered resources.
[INFO] Copying 1 resource
[INFO] skip non existing resourceDirectory /home/geronimo/geronimo/trunk/plugins/openjpa2/geronimo-aries-jpa/src/main/filtered-resources
[INFO] Copying 3 resources
[INFO] [compiler:compile {execution: default-compile}]
[INFO] Compiling 5 source files to /home/geronimo/geronimo/trunk/plugins/openjpa2/geronimo-aries-jpa/target/classes
[INFO] ------------------------------------------------------------------------
[ERROR] BUILD FAILURE
[INFO] ------------------------------------------------------------------------
[INFO] Compilation failure
/home/geronimo/geronimo/trunk/plugins/openjpa2/geronimo-aries-jpa/src/main/java/org/apache/geronimo/aries/jpa/PersistenceBundleHelper.java:[81,46]
cannot find symbol
symbol  : constructor FragmentBuilder(org.osgi.framework.Bundle,java.lang.String,java.lang.String)
location: class org.apache.aries.util.FragmentBuilder


[INFO] ------------------------------------------------------------------------
[INFO] Trace
org.apache.maven.BuildFailureException: Compilation failure
/home/geronimo/geronimo/trunk/plugins/openjpa2/geronimo-aries-jpa/src/main/java/org/apache/geronimo/aries/jpa/PersistenceBundleHelper.java:[81,46]
cannot find symbol
symbol  : constructor FragmentBuilder(org.osgi.framework.Bundle,java.lang.String,java.lang.String)
location: class org.apache.aries.util.FragmentBuilder


	at org.apache.maven.lifecycle.DefaultLifecycleExecutor.executeGoals(DefaultLifecycleExecutor.java:715)
	at org.apache.maven.lifecycle.DefaultLifecycleExecutor.executeGoalWithLifecycle(DefaultLifecycleExecutor.java:556)
	at org.apache.maven.lifecycle.DefaultLifecycleExecutor.executeGoal(DefaultLifecycleExecutor.java:535)
	at org.apache.maven.lifecycle.DefaultLifecycleExecutor.executeGoalAndHandleFailures(DefaultLifecycleExecutor.java:387)
	at org.apache.maven.lifecycle.DefaultLifecycleExecutor.executeTaskSegments(DefaultLifecycleExecutor.java:348)
	at org.apache.maven.lifecycle.DefaultLifecycleExecutor.execute(DefaultLifecycleExecutor.java:180)
	at org.apache.maven.DefaultMaven.doExecute(DefaultMaven.java:328)
	at org.apache.maven.DefaultMaven.execute(DefaultMaven.java:138)
	at org.apache.maven.cli.MavenCli.main(MavenCli.java:362)
	at org.apache.maven.cli.compat.CompatibleMain.main(CompatibleMain.java:60)
	at sun.reflect.NativeMethodAccessorImpl.invoke0(Native Method)
	at sun.reflect.NativeMethodAccessorImpl.invoke(NativeMethodAccessorImpl.java:39)
	at sun.reflect.DelegatingMethodAccessorImpl.invoke(DelegatingMethodAccessorImpl.java:25)
	at java.lang.reflect.Method.invoke(Method.java:597)
	at org.codehaus.classworlds.Launcher.launchEnhanced(Launcher.java:315)
	at org.codehaus.classworlds.Launcher.launch(Launcher.java:255)
	at org.codehaus.classworlds.Launcher.mainWithExitCode(Launcher.java:430)
	at org.codehaus.classworlds.Launcher.main(Launcher.java:375)
Caused by: org.apache.maven.plugin.CompilationFailureException: Compilation failure
/home/geronimo/geronimo/trunk/plugins/openjpa2/geronimo-aries-jpa/src/main/java/org/apache/geronimo/aries/jpa/PersistenceBundleHelper.java:[81,46]
cannot find symbol
symbol  : constructor FragmentBuilder(org.osgi.framework.Bundle,java.lang.String,java.lang.String)
location: class org.apache.aries.util.FragmentBuilder


	at org.apache.maven.plugin.AbstractCompilerMojo.execute(AbstractCompilerMojo.java:516)
	at org.apache.maven.plugin.CompilerMojo.execute(CompilerMojo.java:114)
	at org.apache.maven.plugin.DefaultPluginManager.executeMojo(DefaultPluginManager.java:490)
	at org.apache.maven.lifecycle.DefaultLifecycleExecutor.executeGoals(DefaultLifecycleExecutor.java:694)
	... 17 more
[INFO] ------------------------------------------------------------------------
[INFO] Total time: 16 minutes 56 seconds
[INFO] Finished at: Thu Jun 03 03:18:31 EDT 2010
[INFO] Final Memory: 368M/624M
[INFO] ------------------------------------------------------------------------

Mime
View raw message