geronimo-dev mailing list archives

Site index · List index
Message view « Date » · « Thread »
Top « Date » · « Thread »
From ga...@apache.org
Subject [BUILD] branches/2.1: Failed for Revision: 950373
Date Wed, 02 Jun 2010 07:36:07 GMT
Geronimo Revision: 950373 built with tests included
 
See the full build-0200.log file at http://people.apache.org/builds/geronimo/server/binaries/2.1/20100602/build-0200.log
 
Download the binaries from http://people.apache.org/builds/geronimo/server/binaries/2.1/20100602
[INFO] BUILD SUCCESSFUL
[INFO] ------------------------------------------------------------------------
[INFO] Total time: 29 minutes 39 seconds
[INFO] Finished at: Wed Jun 02 02:35:19 EDT 2010
[INFO] Final Memory: 300M/1009M
[INFO] ------------------------------------------------------------------------
 
TESTSUITE RESULTS (Failures only)
=================================
 
Assembly: tomcat
=================================
See full test results and logs at http://people.apache.org/builds/geronimo/server/binaries/2.1/20100602/logs-0200-tomcat/
 
[INFO] Running console-testsuite.basic-console
[INFO] Tests run: 38, Failures: 1, Errors: 0, Skipped: 0, Time elapsed: 97.187 sec <<<
FAILURE!
[INFO] Running console-testsuite.advance-test
[INFO] Tests run: 15, Failures: 1, Errors: 0, Skipped: 0, Time elapsed: 79.042 sec <<<
FAILURE!
--
[INFO] Running sec-testsuite.security
[INFO] Tests run: 2, Failures: 2, Errors: 0, Skipped: 0, Time elapsed: 0.232 sec <<<
FAILURE!
--
[INFO] Running security-testsuite.security
[INFO] Tests run: 36, Failures: 1, Errors: 0, Skipped: 0, Time elapsed: 29.713 sec <<<
FAILURE!
 
Assembly: jetty
=================================
See full test results and logs at http://people.apache.org/builds/geronimo/server/binaries/2.1/20100602/logs-0200-jetty/
 
[INFO] Running console-testsuite.basic-console
[INFO] Tests run: 38, Failures: 1, Errors: 0, Skipped: 0, Time elapsed: 99.623 sec <<<
FAILURE!
[INFO] Running console-testsuite.advance-test
[INFO] Tests run: 15, Failures: 1, Errors: 0, Skipped: 0, Time elapsed: 80.903 sec <<<
FAILURE!
--
[INFO] Running sec-testsuite.security
[INFO] Tests run: 2, Failures: 1, Errors: 0, Skipped: 0, Time elapsed: 3.774 sec <<<
FAILURE!
 
Samples: branches/2.1
=================================
Log: http://people.apache.org/builds/geronimo/server/binaries/2.1/20100602/samples-0200.log
 
Build status: FAILED
 

Mime
View raw message