geronimo-dev mailing list archives

Site index · List index
Message view « Date » · « Thread »
Top « Date » · « Thread »
From ga...@apache.org
Subject [BUILD] trunk: Failed for Revision: 950064
Date Tue, 01 Jun 2010 14:17:47 GMT
Geronimo Revision: 950064 built with tests included
 
See the full build-0900.log file at http://people.apache.org/builds/geronimo/server/binaries/trunk/20100601/build-0900.log
 
Download the binaries from http://people.apache.org/builds/geronimo/server/binaries/trunk/20100601
[INFO] BUILD SUCCESSFUL
[INFO] ------------------------------------------------------------------------
[INFO] Total time: 33 minutes 45 seconds
[INFO] Finished at: Tue Jun 01 09:47:37 EDT 2010
[INFO] Final Memory: 540M/980M
[INFO] ------------------------------------------------------------------------
 
TESTSUITE RESULTS (Failures only)
=================================
 
Assembly: tomcat
=================================
See full test results and logs at http://people.apache.org/builds/geronimo/server/binaries/trunk/20100601/logs-0900-tomcat/
 
 
262K downloaded  (plexus-utils-1.5.9.jar)
313K downloaded  (surefire-booter-2.5.jar)
Downloading: file:///home/geronimo/.m2/jtidy.repository/org/apache/maven/surefire/surefire-api/2.5/surefire-api-2.5.jar
[INFO] Unable to find resource 'org.apache.maven.surefire:surefire-api:jar:2.5' in repository
local (file:///home/geronimo/.m2/jtidy.repository)
Downloading: http://maven.rtp.raleigh.ibm.com/nexus-proxy//org/apache/maven/surefire/surefire-api/2.5/surefire-api-2.5.jar
557K downloaded  (surefire-api-2.5.jar)
[INFO] [failsafe:integration-test {execution: integration-test}]
[INFO] No tests to run.
[INFO] [ianal:verify-legal-files {execution: default}]
[INFO] [install:install {execution: default-install}]
[INFO] Installing /home/geronimo/geronimo/trunk/testsuite/pom.xml to /home/geronimo/.m2/repository/org/apache/geronimo/testsuite/testsuite/3.0-SNAPSHOT/testsuite-3.0-SNAPSHOT.pom
[INFO] [failsafe:verify {execution: verify}]
[INFO] No tests to run.
[INFO] ------------------------------------------------------------------------
[INFO] Building Geronimo TestSuite :: Commands TestSuite
[INFO]    task-segment: [install]
[INFO] ------------------------------------------------------------------------
[INFO] [genesis:validate-configuration {execution: default}]
[INFO] [geronimo-property:set-property {execution: set-property}]
[INFO] snapshot org.apache.geronimo.testsupport:testsupport-commands:3.0-SNAPSHOT: checking
for updates from codehaus.snapshots
[INFO] snapshot org.apache.geronimo.testsupport:testsupport-commands:3.0-SNAPSHOT: checking
for updates from apache.snapshots
[INFO] [enforcer:enforce {execution: default}]
[INFO] [remote-resources:process {execution: default}]
[INFO] [site:attach-descriptor {execution: default-attach-descriptor}]
[WARNING] DEPRECATED [systemProperties]: Use systemPropertyVariables instead.
[INFO] [failsafe:integration-test {execution: integration-test}]
[INFO] No tests to run.
[INFO] [ianal:verify-legal-files {execution: default}]
[INFO] [install:install {execution: default-install}]
[INFO] Installing /home/geronimo/geronimo/trunk/testsuite/commands-testsuite/pom.xml to /home/geronimo/.m2/repository/org/apache/geronimo/testsuite/commands-testsuite/3.0-SNAPSHOT/commands-testsuite-3.0-SNAPSHOT.pom
[INFO] [failsafe:verify {execution: verify}]
[INFO] No tests to run.
[INFO] ------------------------------------------------------------------------
[INFO] Building Geronimo TestSuite :: Commands Testsuite :: Deployer
[INFO]    task-segment: [install]
[INFO] ------------------------------------------------------------------------
[INFO] [genesis:validate-configuration {execution: default}]
[INFO] [geronimo-property:set-property {execution: set-property}]
[INFO] [enforcer:enforce {execution: default}]
[INFO] [remote-resources:process {execution: default}]
[INFO] [resources:resources {execution: default-resources}]
[INFO] Using 'UTF-8' encoding to copy filtered resources.
[INFO] skip non existing resourceDirectory /home/geronimo/geronimo/trunk/testsuite/commands-testsuite/deploy/src/main/resources
[INFO] skip non existing resourceDirectory /home/geronimo/geronimo/trunk/testsuite/commands-testsuite/deploy/src/main/filtered-resources
[INFO] Copying 3 resources
[INFO] [compiler:compile {execution: default-compile}]
[INFO] No sources to compile
[INFO] [resources:testResources {execution: default-testResources}]
[INFO] Using 'UTF-8' encoding to copy filtered resources.
[INFO] Copying 1 resource
[INFO] skip non existing resourceDirectory /home/geronimo/geronimo/trunk/testsuite/commands-testsuite/deploy/src/test/filtered-resources
[INFO] Copying 3 resources
[INFO] [compiler:testCompile {execution: default-testCompile}]
[INFO] Compiling 2 source files to /home/geronimo/geronimo/trunk/testsuite/commands-testsuite/deploy/target/test-classes
[INFO] [surefire:test {execution: default-test}]
[INFO] Tests are skipped.
[INFO] [jar:jar {execution: default-jar}]
[INFO] Building jar: /home/geronimo/geronimo/trunk/testsuite/commands-testsuite/deploy/target/deploy-3.0-SNAPSHOT.jar
[org.codehaus.mojo.pluginsupport.logging.Logging] : Initialized
[INFO] [geronimo:start-server {execution: start-geronimo}]
[INFO] Using assembly configuration: tomcat
[INFO] snapshot org.apache.geronimo.assemblies:geronimo-tomcat7-javaee6:3.0-SNAPSHOT: checking
for updates from codehaus.snapshots
[INFO] snapshot org.apache.geronimo.assemblies:geronimo-tomcat7-javaee6:3.0-SNAPSHOT: checking
for updates from apache.snapshots
[INFO] Using assembly artifact: org.apache.geronimo.assemblies:geronimo-tomcat7-javaee6:zip:bin:3.0-SNAPSHOT:provided
[INFO] Using geronimoHome: /home/geronimo/geronimo/trunk/testsuite/commands-testsuite/deploy/target/geronimo-tomcat7-javaee6-3.0-SNAPSHOT
[INFO] Installing assembly...
[INFO] Expanding: /home/geronimo/.m2/repository/org/apache/geronimo/assemblies/geronimo-tomcat7-javaee6/3.0-SNAPSHOT/geronimo-tomcat7-javaee6-3.0-SNAPSHOT-bin.zip
into /home/geronimo/geronimo/trunk/testsuite/commands-testsuite/deploy/target
[INFO] Starting Geronimo server...
[INFO] Selected option set: default
[INFO] Redirecting output to: /home/geronimo/geronimo/trunk/testsuite/commands-testsuite/deploy/target/geronimo-logs/org.apache.geronimo.mavenplugins.geronimo.server.StartServerMojo.log
[INFO] Waiting for Geronimo server...
[org.apache.geronimo.mavenplugins.geronimo.ServerProxy] : Initialized with URL: service:jmx:rmi://localhost/jndi/rmi://localhost:1099/JMXConnector,
environment: {jmx.remote.credentials=[Ljava.lang.String;@a7c8bd}
[org.apache.geronimo.mavenplugins.geronimo.ServerProxy] : Connecting to: service:jmx:rmi://localhost/jndi/rmi://localhost:1099/JMXConnector
[org.apache.geronimo.mavenplugins.geronimo.ServerProxy] : Connection failure; ignoring: java.io.IOException:
Failed to retrieve RMIServer stub: javax.naming.ServiceUnavailableException [Root exception
is java.rmi.ConnectException: Connection refused to host: localhost; nested exception is:

	java.net.ConnectException: Connection refused]
[org.apache.geronimo.mavenplugins.geronimo.ServerProxy] : Connecting to: service:jmx:rmi://localhost/jndi/rmi://localhost:1099/JMXConnector
[org.apache.geronimo.mavenplugins.geronimo.ServerProxy] : Connection failure; ignoring: java.io.IOException:
Failed to retrieve RMIServer stub: javax.naming.ServiceUnavailableException [Root exception
is java.rmi.ConnectException: Connection refused to host: localhost; nested exception is:

	java.net.ConnectException: Connection refused]
[org.apache.geronimo.mavenplugins.geronimo.ServerProxy] : Connecting to: service:jmx:rmi://localhost/jndi/rmi://localhost:1099/JMXConnector
[org.apache.geronimo.mavenplugins.geronimo.ServerProxy] : Connection failure; ignoring: java.io.IOException:
Failed to retrieve RMIServer stub: javax.naming.ServiceUnavailableException [Root exception
is java.rmi.ConnectException: Connection refused to host: localhost; nested exception is:

	java.net.ConnectException: Connection refused]
[org.apache.geronimo.mavenplugins.geronimo.ServerProxy] : Connecting to: service:jmx:rmi://localhost/jndi/rmi://localhost:1099/JMXConnector
[org.apache.geronimo.mavenplugins.geronimo.ServerProxy] : Connected
[INFO] Geronimo server started in 0:00:36.578
[WARNING] DEPRECATED [systemProperties]: Use systemPropertyVariables instead.
[INFO] [failsafe:integration-test {execution: integration-test}]
Downloading: http://maven.rtp.raleigh.ibm.com/nexus-proxy//org/apache/maven/surefire/surefire-testng/2.5/surefire-testng-2.5.pom
2K downloaded  (surefire-testng-2.5.pom)
Downloading: http://maven.rtp.raleigh.ibm.com/nexus-proxy//org/apache/maven/surefire/surefire-providers/2.5/surefire-providers-2.5.pom
1K downloaded  (surefire-providers-2.5.pom)
Downloading: http://maven.rtp.raleigh.ibm.com/nexus-proxy//org/apache/maven/surefire/surefire-testng/2.5/surefire-testng-2.5.jar
26K downloaded  (surefire-testng-2.5.jar)
[INFO] Failsafe report directory: /home/geronimo/geronimo/trunk/testsuite/commands-testsuite/deploy/target/failsafe-reports

-------------------------------------------------------
 T E S T S
-------------------------------------------------------
Running TestSuite
killed.
[INFO] ------------------------------------------------------------------------
[ERROR] BUILD ERROR
 
Assembly: jetty
=================================
See full test results and logs at http://people.apache.org/builds/geronimo/server/binaries/trunk/20100601/logs-0900-jetty/
 
Running TestSuite
Tests run: 1, Failures: 1, Errors: 0, Skipped: 0, Time elapsed: 40.887 sec <<< FAILURE!
 
[INFO] Copying 3 resources
[INFO] [compiler:testCompile {execution: default-testCompile}]
[INFO] No sources to compile
[INFO] [surefire:test {execution: default-test}]
[INFO] Tests are skipped.
[INFO] [war:war {execution: default-war}]
[INFO] Packaging webapp
[INFO] Assembling webapp[appname-war] in [/home/geronimo/geronimo/trunk/testsuite/enterprise-testsuite/appname-tests/appname-war/target/appname-war-3.0-SNAPSHOT]
[INFO] Processing war project
[INFO] Copying webapp webResources[/home/geronimo/geronimo/trunk/testsuite/enterprise-testsuite/appname-tests/appname-war/src/main/webapp]
to[/home/geronimo/geronimo/trunk/testsuite/enterprise-testsuite/appname-tests/appname-war/target/appname-war-3.0-SNAPSHOT]
[INFO] Copying webapp webResources[/home/geronimo/geronimo/trunk/testsuite/enterprise-testsuite/appname-tests/appname-war/target/classes]
to[/home/geronimo/geronimo/trunk/testsuite/enterprise-testsuite/appname-tests/appname-war/target/appname-war-3.0-SNAPSHOT]
[INFO] Copying webapp resources[/home/geronimo/geronimo/trunk/testsuite/enterprise-testsuite/appname-tests/appname-war/src/main/webapp]
[INFO] Building jar: /home/geronimo/geronimo/trunk/testsuite/enterprise-testsuite/appname-tests/appname-war/target/appname-war-3.0-SNAPSHOT/WEB-INF/lib/appname-war-3.0-SNAPSHOT.jar
[INFO] Webapp assembled in[66 msecs]
[INFO] Building war: /home/geronimo/geronimo/trunk/testsuite/enterprise-testsuite/appname-tests/appname-war/target/appname-war-3.0-SNAPSHOT.war
[INFO] [failsafe:integration-test {execution: integration-test}]
[INFO] Failsafe report directory: /home/geronimo/geronimo/trunk/testsuite/enterprise-testsuite/appname-tests/appname-war/target/failsafe-reports

-------------------------------------------------------
 T E S T S
-------------------------------------------------------
There are no tests to run.

Results :

Tests run: 0, Failures: 0, Errors: 0, Skipped: 0

[INFO] [ianal:verify-legal-files {execution: default}]
[WARNING] Skipping verification of legal files in artifacts:
[WARNING]     org.apache.geronimo.testsuite:appname-war:war:3.0-SNAPSHOT
[INFO] [install:install {execution: default-install}]
[INFO] Installing /home/geronimo/geronimo/trunk/testsuite/enterprise-testsuite/appname-tests/appname-war/target/appname-war-3.0-SNAPSHOT.war
to /home/geronimo/.m2/repository/org/apache/geronimo/testsuite/appname-war/3.0-SNAPSHOT/appname-war-3.0-SNAPSHOT.war
[INFO] [failsafe:verify {execution: verify}]
[INFO] Failsafe report directory: /home/geronimo/geronimo/trunk/testsuite/enterprise-testsuite/appname-tests/appname-war/target/failsafe-reports
[INFO] ------------------------------------------------------------------------
[INFO] Building Geronimo TestSuite :: Enterprise Testsuite :: AppName - Client
[INFO]    task-segment: [install]
[INFO] ------------------------------------------------------------------------
[INFO] [genesis:validate-configuration {execution: default}]
[INFO] [geronimo-property:set-property {execution: set-property}]
[INFO] [enforcer:enforce {execution: default}]
[INFO] [remote-resources:process {execution: default}]
[INFO] [resources:resources {execution: default-resources}]
[INFO] Using 'UTF-8' encoding to copy filtered resources.
[INFO] Copying 2 resources
[INFO] skip non existing resourceDirectory /home/geronimo/geronimo/trunk/testsuite/enterprise-testsuite/appname-tests/appname-client/src/main/filtered-resources
[INFO] Copying 3 resources
[INFO] [compiler:compile {execution: default-compile}]
[INFO] Compiling 1 source file to /home/geronimo/geronimo/trunk/testsuite/enterprise-testsuite/appname-tests/appname-client/target/classes
[INFO] [resources:testResources {execution: default-testResources}]
[INFO] Using 'UTF-8' encoding to copy filtered resources.
[INFO] skip non existing resourceDirectory /home/geronimo/geronimo/trunk/testsuite/enterprise-testsuite/appname-tests/appname-client/src/test/resources
[INFO] skip non existing resourceDirectory /home/geronimo/geronimo/trunk/testsuite/enterprise-testsuite/appname-tests/appname-client/src/test/filtered-resources
[INFO] Copying 3 resources
[INFO] [compiler:testCompile {execution: default-testCompile}]
[INFO] Compiling 1 source file to /home/geronimo/geronimo/trunk/testsuite/enterprise-testsuite/appname-tests/appname-client/target/test-classes
[INFO] [surefire:test {execution: default-test}]
[INFO] Tests are skipped.
[INFO] [jar:jar {execution: default-jar}]
[INFO] Building jar: /home/geronimo/geronimo/trunk/testsuite/enterprise-testsuite/appname-tests/appname-client/target/appname-client-3.0-SNAPSHOT.jar
[INFO] [geronimo:start-server {execution: start-geronimo}]
[INFO] Using assembly configuration: jetty
[INFO] Using assembly artifact: org.apache.geronimo.assemblies:geronimo-jetty8-javaee6:zip:bin:3.0-SNAPSHOT:provided
[INFO] Using geronimoHome: /home/geronimo/geronimo/trunk/testsuite/enterprise-testsuite/appname-tests/appname-client/target/geronimo-jetty8-javaee6-3.0-SNAPSHOT
[INFO] Installing assembly...
[INFO] Expanding: /home/geronimo/.m2/repository/org/apache/geronimo/assemblies/geronimo-jetty8-javaee6/3.0-SNAPSHOT/geronimo-jetty8-javaee6-3.0-SNAPSHOT-bin.zip
into /home/geronimo/geronimo/trunk/testsuite/enterprise-testsuite/appname-tests/appname-client/target
[INFO] Starting Geronimo server...
[INFO] Selected option set: default
[INFO] Redirecting output to: /home/geronimo/geronimo/trunk/testsuite/enterprise-testsuite/appname-tests/appname-client/target/geronimo-logs/org.apache.geronimo.mavenplugins.geronimo.server.StartServerMojo.log
[INFO] Waiting for Geronimo server...
[org.apache.geronimo.mavenplugins.geronimo.ServerProxy] : Initialized with URL: service:jmx:rmi://localhost/jndi/rmi://localhost:1099/JMXConnector,
environment: {jmx.remote.credentials=[Ljava.lang.String;@2b6ff2}
[org.apache.geronimo.mavenplugins.geronimo.ServerProxy] : Connecting to: service:jmx:rmi://localhost/jndi/rmi://localhost:1099/JMXConnector
[org.apache.geronimo.mavenplugins.geronimo.ServerProxy] : Connection failure; ignoring: java.io.IOException:
Failed to retrieve RMIServer stub: javax.naming.ServiceUnavailableException [Root exception
is java.rmi.ConnectException: Connection refused to host: localhost; nested exception is:

	java.net.ConnectException: Connection refused]
[org.apache.geronimo.mavenplugins.geronimo.ServerProxy] : Connecting to: service:jmx:rmi://localhost/jndi/rmi://localhost:1099/JMXConnector
[org.apache.geronimo.mavenplugins.geronimo.ServerProxy] : Connection failure; ignoring: java.io.IOException:
Failed to retrieve RMIServer stub: javax.naming.ServiceUnavailableException [Root exception
is java.rmi.ConnectException: Connection refused to host: localhost; nested exception is:

	java.net.ConnectException: Connection refused]
[org.apache.geronimo.mavenplugins.geronimo.ServerProxy] : Connecting to: service:jmx:rmi://localhost/jndi/rmi://localhost:1099/JMXConnector
[org.apache.geronimo.mavenplugins.geronimo.ServerProxy] : Connected
[INFO] Geronimo server started in 0:00:30.265
[INFO] [geronimo:deploy-module {execution: deploy-client}]
[INFO] Using non-artifact based module archive: /home/geronimo/geronimo/trunk/testsuite/enterprise-testsuite/appname-tests/appname-client/target/appname-client-3.0-SNAPSHOT.jar
[INFO] Distributing module artifact: /home/geronimo/geronimo/trunk/testsuite/enterprise-testsuite/appname-tests/appname-client/target/appname-client-3.0-SNAPSHOT.jar
[org.apache.geronimo.deployment.plugin.factories.BaseDeploymentFactory] : Parsing URI=deployer:geronimo:jmx://localhost:1099
[org.apache.geronimo.deployment.plugin.factories.BaseDeploymentFactory] : Parsing URI=deployer:geronimo:jmx://localhost:1099
[org.apache.geronimo.deployment.plugin.factories.BaseDeploymentFactory] : Using protocol=jmx,
host=localhost, port=1099
[org.apache.geronimo.deployment.plugin.factories.BaseDeploymentFactory] : Using JMXServiceURL
with host=localhost, port=1099, secure=false
[INFO] Starting modules...
[INFO] Starting module: JEE5/AppNameClientServer/1.0/jar
[INFO] Started module(s):
[INFO]     [0] JEE5/AppNameClientServer/1.0/jar
[INFO]         [0] JEE5/AppNameClient/1.0/jar
[INFO] [geronimo:run-client {execution: run-client}]
[org.apache.geronimo.mavenplugins.geronimo.ServerProxy] : Initialized with URL: service:jmx:rmi://localhost/jndi/rmi://localhost:1099/JMXConnector,
environment: {jmx.remote.credentials=[Ljava.lang.String;@18783c9}
[org.apache.geronimo.mavenplugins.geronimo.ServerProxy] : Connecting to: service:jmx:rmi://localhost/jndi/rmi://localhost:1099/JMXConnector
[org.apache.geronimo.mavenplugins.geronimo.ServerProxy] : Connected
[INFO] Geronimo Home: /home/geronimo/geronimo/trunk/testsuite/enterprise-testsuite/appname-tests/appname-client/target/geronimo-jetty8-javaee6-3.0-SNAPSHOT
[INFO] Starting Geronimo client...
[INFO] Redirecting output to: /home/geronimo/geronimo/trunk/testsuite/enterprise-testsuite/appname-tests/appname-client/target/client.log
[INFO] ------------------------------------------------------------------------
[ERROR] BUILD ERROR
 
Samples: trunk
=================================
Log: http://people.apache.org/builds/geronimo/server/binaries/trunk/20100601/samples-0900.log
 
Build status: FAILED
 

Mime
View raw message