geronimo-dev mailing list archives

Site index · List index
Message view « Date » · « Thread »
Top « Date » · « Thread »
From ga...@apache.org
Subject [BUILD] branches/2.2: Failed for Revision: 946479
Date Wed, 19 May 2010 23:38:32 GMT
Geronimo Revision: 946479 built with tests included
 
See the full build-2000.log file at http://people.apache.org/builds/geronimo/server/binaries/2.2/20100519/build-2000.log
 
 
See the unit test reports at http://people.apache.org/builds/geronimo/server/binaries/2.2/20100519/unit-test-reports
 
[WARNING] Component returned which is not the same manager. Ignored. component=org.apache.maven.profiles.activation.SystemPropertyProfileActivator@36fe36fe
[WARNING] Component returned which is not the same manager. Ignored. component=org.apache.maven.profiles.activation.FileProfileActivator@2dc02dc0
[WARNING] Component returned which is not the same manager. Ignored. component=org.apache.maven.profiles.activation.OperatingSystemProfileActivator@2dc02dc0
[WARNING] Component returned which is not the same manager. Ignored. component=org.apache.maven.profiles.activation.SystemPropertyProfileActivator@36fe36fe
[WARNING] Component returned which is not the same manager. Ignored. component=org.apache.maven.profiles.activation.FileProfileActivator@2dc02dc0
[WARNING] Component returned which is not the same manager. Ignored. component=org.apache.maven.profiles.activation.OperatingSystemProfileActivator@2dc02dc0
[WARNING] Component returned which is not the same manager. Ignored. component=org.apache.maven.profiles.activation.SystemPropertyProfileActivator@36fe36fe
[WARNING] Component returned which is not the same manager. Ignored. component=org.apache.maven.profiles.activation.FileProfileActivator@2dc02dc0
[WARNING] Component returned which is not the same manager. Ignored. component=org.apache.maven.profiles.activation.OperatingSystemProfileActivator@2dc02dc0
[WARNING] Component returned which is not the same manager. Ignored. component=org.apache.maven.profiles.activation.SystemPropertyProfileActivator@36fe36fe
[WARNING] Component returned which is not the same manager. Ignored. component=org.apache.maven.profiles.activation.FileProfileActivator@2dc02dc0
[WARNING] Component returned which is not the same manager. Ignored. component=org.apache.maven.profiles.activation.OperatingSystemProfileActivator@2dc02dc0
[WARNING] Component returned which is not the same manager. Ignored. component=org.apache.maven.profiles.activation.SystemPropertyProfileActivator@36fe36fe
[WARNING] Component returned which is not the same manager. Ignored. component=org.apache.maven.profiles.activation.FileProfileActivator@2dc02dc0
[WARNING] Component returned which is not the same manager. Ignored. component=org.apache.maven.profiles.activation.OperatingSystemProfileActivator@2dc02dc0
Downloading: http://maven.rtp.raleigh.ibm.com/nexus-proxy//org/apache/xbean/xbean-naming/3.7/xbean-naming-3.7.jar
53K downloaded
[INFO] [enforcer:enforce {execution: default}]
[INFO] [remote-resources:process {execution: default}]
[INFO] [resources:resources]
[INFO] Using 'UTF-8' encoding to copy filtered resources.
[INFO] skip non existing resourceDirectory /home/geronimo/geronimo/2.2/framework/modules/geronimo-naming/src/main/resources
[INFO] skip non existing resourceDirectory /home/geronimo/geronimo/2.2/framework/modules/geronimo-naming/src/main/filtered-resources
[INFO] Copying 3 resources
[INFO] [compiler:compile]
[INFO] Compiling 27 source files to /home/geronimo/geronimo/2.2/framework/modules/geronimo-naming/target/classes
[INFO] [resources:testResources]
[INFO] Using 'UTF-8' encoding to copy filtered resources.
[INFO] skip non existing resourceDirectory /home/geronimo/geronimo/2.2/framework/modules/geronimo-naming/src/test/resources
[INFO] skip non existing resourceDirectory /home/geronimo/geronimo/2.2/framework/modules/geronimo-naming/src/test/filtered-resources
[INFO] Copying 3 resources
[INFO] [compiler:testCompile]
[INFO] Compiling 8 source files to /home/geronimo/geronimo/2.2/framework/modules/geronimo-naming/target/test-classes
[INFO] [surefire:test]
[WARNING] Component returned which is not the same manager. Ignored. component=org.apache.maven.profiles.activation.SystemPropertyProfileActivator@36fe36fe
[WARNING] Component returned which is not the same manager. Ignored. component=org.apache.maven.profiles.activation.FileProfileActivator@2dc02dc0
[WARNING] Component returned which is not the same manager. Ignored. component=org.apache.maven.profiles.activation.OperatingSystemProfileActivator@2dc02dc0
[INFO] Surefire report directory: /home/geronimo/geronimo/2.2/framework/modules/geronimo-naming/target/surefire-reports

-------------------------------------------------------
 T E S T S
-------------------------------------------------------
Running org.apache.geronimo.gjndi.JavaCompContextTest
Tests run: 8, Failures: 0, Errors: 0, Skipped: 0, Time elapsed: 0.604 sec
Running org.apache.geronimo.gjndi.binding.FormatTest
Tests run: 2, Failures: 0, Errors: 0, Skipped: 0, Time elapsed: 0.045 sec
Running org.apache.geronimo.gjndi.KernelContextGBeanTest
Tests run: 3, Failures: 1, Errors: 0, Skipped: 0, Time elapsed: 0.921 sec <<< FAILURE!
Running org.apache.geronimo.gjndi.binding.GBeanBindingTest
Tests run: 1, Failures: 0, Errors: 0, Skipped: 0, Time elapsed: 0.133 sec
Running org.apache.geronimo.gjndi.JavaCompGBeanTest
Tests run: 1, Failures: 0, Errors: 0, Skipped: 0, Time elapsed: 0.091 sec

Results :

Failed tests: 
  test(org.apache.geronimo.gjndi.KernelContextGBeanTest)

Tests run: 15, Failures: 1, Errors: 0, Skipped: 0

[INFO] ------------------------------------------------------------------------
[ERROR] BUILD FAILURE
[INFO] ------------------------------------------------------------------------
[INFO] There are test failures.

Please refer to /home/geronimo/geronimo/2.2/framework/modules/geronimo-naming/target/surefire-reports
for the individual test results.
[INFO] ------------------------------------------------------------------------
[INFO] Trace
org.apache.maven.BuildFailureException: There are test failures.

Please refer to /home/geronimo/geronimo/2.2/framework/modules/geronimo-naming/target/surefire-reports
for the individual test results.
	at org.apache.maven.lifecycle.DefaultLifecycleExecutor.executeGoals(DefaultLifecycleExecutor.java:580)
	at org.apache.maven.lifecycle.DefaultLifecycleExecutor.executeGoalWithLifecycle(DefaultLifecycleExecutor.java:500)
	at org.apache.maven.lifecycle.DefaultLifecycleExecutor.executeGoal(DefaultLifecycleExecutor.java:479)
	at org.apache.maven.lifecycle.DefaultLifecycleExecutor.executeGoalAndHandleFailures(DefaultLifecycleExecutor.java:331)
	at org.apache.maven.lifecycle.DefaultLifecycleExecutor.executeTaskSegments(DefaultLifecycleExecutor.java:292)
	at org.apache.maven.lifecycle.DefaultLifecycleExecutor.execute(DefaultLifecycleExecutor.java:142)
	at org.apache.maven.DefaultMaven.doExecute(DefaultMaven.java:336)
	at org.apache.maven.DefaultMaven.execute(DefaultMaven.java:129)
	at org.apache.maven.cli.MavenCli.main(MavenCli.java:301)
	at sun.reflect.NativeMethodAccessorImpl.invoke0(Native Method)
	at sun.reflect.NativeMethodAccessorImpl.invoke(NativeMethodAccessorImpl.java:79)
	at sun.reflect.DelegatingMethodAccessorImpl.invoke(DelegatingMethodAccessorImpl.java:43)
	at java.lang.reflect.Method.invoke(Method.java:618)
	at org.codehaus.classworlds.Launcher.launchEnhanced(Launcher.java:315)
	at org.codehaus.classworlds.Launcher.launch(Launcher.java:255)
	at org.codehaus.classworlds.Launcher.mainWithExitCode(Launcher.java:430)
	at org.codehaus.classworlds.Launcher.main(Launcher.java:375)
Caused by: org.apache.maven.plugin.MojoFailureException: There are test failures.

Please refer to /home/geronimo/geronimo/2.2/framework/modules/geronimo-naming/target/surefire-reports
for the individual test results.
	at org.apache.maven.plugin.surefire.SurefirePlugin.execute(SurefirePlugin.java:575)
	at org.apache.maven.plugin.DefaultPluginManager.executeMojo(DefaultPluginManager.java:453)
	at org.apache.maven.lifecycle.DefaultLifecycleExecutor.executeGoals(DefaultLifecycleExecutor.java:559)
	... 16 more
[INFO] ------------------------------------------------------------------------
[INFO] Total time: 5 minutes 15 seconds
[INFO] Finished at: Wed May 19 20:07:46 EDT 2010
[INFO] Final Memory: 184M/512M
[INFO] ------------------------------------------------------------------------

Mime
View raw message