geronimo-dev mailing list archives

Site index · List index
Message view « Date » · « Thread »
Top « Date » · « Thread »
From ga...@apache.org
Subject [BUILD] branches/2.1: Failed for Revision: 946033
Date Wed, 19 May 2010 05:40:50 GMT
Geronimo Revision: 946033 built with tests included
 
See the full build-0200.log file at http://people.apache.org/builds/geronimo/server/binaries/2.1/20100519/build-0200.log
 
 
See the unit test reports at http://people.apache.org/builds/geronimo/server/binaries/2.1/20100519/unit-test-reports
 

[WARNING] /home/geronimo/geronimo/2.1/framework/modules/geronimo-system/src/test/java/org/apache/geronimo/system/configuration/ServerOverrideTest.java:[271,13]
[deprecation] setAttribute(java.lang.String,java.lang.String) in org.apache.geronimo.system.configuration.GBeanOverride
has been deprecated

[WARNING] /home/geronimo/geronimo/2.1/framework/modules/geronimo-system/src/test/java/org/apache/geronimo/system/configuration/ServerOverrideTest.java:[275,13]
[deprecation] setAttribute(java.lang.String,java.lang.String) in org.apache.geronimo.system.configuration.GBeanOverride
has been deprecated

[INFO] [surefire:test]
[INFO] Surefire report directory: /home/geronimo/geronimo/2.1/framework/modules/geronimo-system/target/surefire-reports

-------------------------------------------------------
 T E S T S
-------------------------------------------------------
Running org.apache.geronimo.system.logging.log4j.XLevelTest
Tests run: 4, Failures: 0, Errors: 0, Skipped: 0, Time elapsed: 0.091 sec
Running org.apache.geronimo.system.logging.log4j.ApplicationLog4jConfigurationTest
Tests run: 1, Failures: 0, Errors: 0, Skipped: 0, Time elapsed: 0.08 sec
Running org.apache.geronimo.system.configuration.ConfigurationStoreUtilTest
Tests run: 4, Failures: 0, Errors: 0, Skipped: 0, Time elapsed: 0.249 sec
Running org.apache.geronimo.system.properties.NamingPropertiesTest
Tests run: 1, Failures: 0, Errors: 0, Skipped: 0, Time elapsed: 0.08 sec
Running org.apache.geronimo.system.configuration.condition.OgnlConditionParserTest
Tests run: 7, Failures: 0, Errors: 0, Skipped: 0, Time elapsed: 0.284 sec
Running org.apache.geronimo.system.configuration.condition.JexlConditionParserTest
Tests run: 7, Failures: 0, Errors: 0, Skipped: 0, Time elapsed: 0.178 sec
Running org.apache.geronimo.system.configuration.GBeanOverrideTest
Tests run: 8, Failures: 0, Errors: 7, Skipped: 0, Time elapsed: 0.782 sec <<< FAILURE!
Running org.apache.geronimo.system.configuration.ServerOverrideTest
Tests run: 7, Failures: 0, Errors: 6, Skipped: 0, Time elapsed: 0.059 sec <<< FAILURE!
Running org.apache.geronimo.system.configuration.InPlaceConfigurationUtilTest
Tests run: 3, Failures: 0, Errors: 0, Skipped: 0, Time elapsed: 0.061 sec
Running org.apache.geronimo.system.configuration.LocalAttributeManagerReadWriteTest
Tests run: 1, Failures: 0, Errors: 1, Skipped: 0, Time elapsed: 0.063 sec <<< FAILURE!
Running org.apache.geronimo.system.serverinfo.ServerInfoTest
Tests run: 5, Failures: 0, Errors: 0, Skipped: 0, Time elapsed: 0.025 sec
Running org.apache.geronimo.system.configuration.condition.JexlExpressionParserTest
Tests run: 5, Failures: 0, Errors: 0, Skipped: 0, Time elapsed: 0.015 sec
Running org.apache.geronimo.system.configuration.LocalAttributeManagerTest
Tests run: 10, Failures: 0, Errors: 2, Skipped: 0, Time elapsed: 0.663 sec <<< FAILURE!

Results :

Tests in error: 
  testPropertyEditorIsCarriedByWriteXml(org.apache.geronimo.system.configuration.GBeanOverrideTest)
  testPropertyEditorIsUsedToGetTextValue(org.apache.geronimo.system.configuration.GBeanOverrideTest)
  testPropertyEditorIsDefinedWhenAttributeIsNotAPrimitiveAndItsTypeDoesNotEqualValueType(org.apache.geronimo.system.configuration.GBeanOverrideTest)
  testPropertyEditorIsNotDefinedWhenAttributeTypeEqualsValueType(org.apache.geronimo.system.configuration.GBeanOverrideTest)
  testPropertyEditorIsNotDefinedForPrimitives(org.apache.geronimo.system.configuration.GBeanOverrideTest)
  testPropertyEditorIsNotDefinedForCollectionSubClasses(org.apache.geronimo.system.configuration.GBeanOverrideTest)
  testAttributes(org.apache.geronimo.system.configuration.GBeanOverrideTest)
  testGBeanXml(org.apache.geronimo.system.configuration.ServerOverrideTest)
  testConfigurationXml(org.apache.geronimo.system.configuration.ServerOverrideTest)
  testServerXml(org.apache.geronimo.system.configuration.ServerOverrideTest)
  testCommentXml(org.apache.geronimo.system.configuration.ServerOverrideTest)
  testReferenceXml(org.apache.geronimo.system.configuration.ServerOverrideTest)
  testExpressionXml(org.apache.geronimo.system.configuration.ServerOverrideTest)
  testReadWrite(org.apache.geronimo.system.configuration.LocalAttributeManagerReadWriteTest)
  testSetAttribute(org.apache.geronimo.system.configuration.LocalAttributeManagerTest)
  testEncryptedAttribute(org.apache.geronimo.system.configuration.LocalAttributeManagerTest)

Tests run: 63, Failures: 0, Errors: 16, Skipped: 0

[INFO] ------------------------------------------------------------------------
[ERROR] BUILD FAILURE
[INFO] ------------------------------------------------------------------------
[INFO] There are test failures.

Please refer to /home/geronimo/geronimo/2.1/framework/modules/geronimo-system/target/surefire-reports
for the individual test results.
[INFO] ------------------------------------------------------------------------
[INFO] Trace
org.apache.maven.BuildFailureException: There are test failures.

Please refer to /home/geronimo/geronimo/2.1/framework/modules/geronimo-system/target/surefire-reports
for the individual test results.
	at org.apache.maven.lifecycle.DefaultLifecycleExecutor.executeGoals(DefaultLifecycleExecutor.java:579)
	at org.apache.maven.lifecycle.DefaultLifecycleExecutor.executeGoalWithLifecycle(DefaultLifecycleExecutor.java:499)
	at org.apache.maven.lifecycle.DefaultLifecycleExecutor.executeGoal(DefaultLifecycleExecutor.java:478)
	at org.apache.maven.lifecycle.DefaultLifecycleExecutor.executeGoalAndHandleFailures(DefaultLifecycleExecutor.java:330)
	at org.apache.maven.lifecycle.DefaultLifecycleExecutor.executeTaskSegments(DefaultLifecycleExecutor.java:291)
	at org.apache.maven.lifecycle.DefaultLifecycleExecutor.execute(DefaultLifecycleExecutor.java:142)
	at org.apache.maven.DefaultMaven.doExecute(DefaultMaven.java:336)
	at org.apache.maven.DefaultMaven.execute(DefaultMaven.java:129)
	at org.apache.maven.cli.MavenCli.main(MavenCli.java:287)
	at sun.reflect.NativeMethodAccessorImpl.invoke0(Native Method)
	at sun.reflect.NativeMethodAccessorImpl.invoke(NativeMethodAccessorImpl.java:39)
	at sun.reflect.DelegatingMethodAccessorImpl.invoke(DelegatingMethodAccessorImpl.java:25)
	at java.lang.reflect.Method.invoke(Method.java:585)
	at org.codehaus.classworlds.Launcher.launchEnhanced(Launcher.java:315)
	at org.codehaus.classworlds.Launcher.launch(Launcher.java:255)
	at org.codehaus.classworlds.Launcher.mainWithExitCode(Launcher.java:430)
	at org.codehaus.classworlds.Launcher.main(Launcher.java:375)
Caused by: org.apache.maven.plugin.MojoFailureException: There are test failures.

Please refer to /home/geronimo/geronimo/2.1/framework/modules/geronimo-system/target/surefire-reports
for the individual test results.
	at org.apache.maven.plugin.surefire.SurefirePlugin.execute(SurefirePlugin.java:575)
	at org.apache.maven.plugin.DefaultPluginManager.executeMojo(DefaultPluginManager.java:451)
	at org.apache.maven.lifecycle.DefaultLifecycleExecutor.executeGoals(DefaultLifecycleExecutor.java:558)
	... 16 more
[INFO] ------------------------------------------------------------------------
[INFO] Total time: 6 minutes 7 seconds
[INFO] Finished at: Wed May 19 02:10:17 EDT 2010
[INFO] Final Memory: 169M/558M
[INFO] ------------------------------------------------------------------------

Mime
View raw message