geronimo-dev mailing list archives

Site index · List index
Message view « Date » · « Thread »
Top « Date » · « Thread »
From ga...@apache.org
Subject [BUILD] trunk: Failed for Revision: 941592
Date Thu, 06 May 2010 07:43:35 GMT
Geronimo Revision: 941592 built with tests included
 
See the full build-0300.log file at http://people.apache.org/builds/geronimo/server/binaries/trunk/20100506/build-0300.log
 
 
See the unit test reports at http://people.apache.org/builds/geronimo/server/binaries/trunk/20100506/unit-test-reports
 
[INFO] Copying 8 resources
[INFO] skip non existing resourceDirectory /home/geronimo/geronimo/trunk/plugins/webservices/geronimo-webservices-builder/src/test/filtered-resources
[INFO] Copying 3 resources
[INFO] [compiler:testCompile {execution: default-testCompile}]
[INFO] Compiling 1 source file to /home/geronimo/geronimo/trunk/plugins/webservices/geronimo-webservices-builder/target/test-classes
[INFO] [surefire:test {execution: default-test}]
[INFO] Surefire report directory: /home/geronimo/geronimo/trunk/plugins/webservices/geronimo-webservices-builder/target/surefire-reports

-------------------------------------------------------
 T E S T S
-------------------------------------------------------
Running org.apache.geronimo.webservices.builder.ParsingTest
Tests run: 8, Failures: 0, Errors: 0, Skipped: 0, Time elapsed: 1.499 sec

Results :

Tests run: 8, Failures: 0, Errors: 0, Skipped: 0

[INFO] [bundle:bundle {execution: default-bundle}]
[INFO] [geronimo-osgi:verify-manifest {execution: verify-manifest}]
[INFO] Resolving OSGi bundle: org.apache.geronimo.modules.geronimo-webservices-builder
[INFO] OSGi bundle is resolved: org.apache.geronimo.modules.geronimo-webservices-builder
[INFO] [ianal:verify-legal-files {execution: default}]
[INFO] Checking legal files in: geronimo-webservices-builder-3.0-SNAPSHOT.jar
[INFO] [install:install {execution: default-install}]
[INFO] Installing /home/geronimo/geronimo/trunk/plugins/webservices/geronimo-webservices-builder/target/geronimo-webservices-builder-3.0-SNAPSHOT.jar
to /home/geronimo/.m2/repository/org/apache/geronimo/modules/geronimo-webservices-builder/3.0-SNAPSHOT/geronimo-webservices-builder-3.0-SNAPSHOT.jar
[INFO] [bundle:install {execution: default-install}]
[INFO] Parsing file:/home/geronimo/.m2/repository/repository.xml
[INFO] Installing org/apache/geronimo/modules/geronimo-webservices-builder/3.0-SNAPSHOT/geronimo-webservices-builder-3.0-SNAPSHOT.jar
[INFO] Writing OBR metadata
[INFO] ------------------------------------------------------------------------
[INFO] Building Geronimo Plugins, OpenEJB :: Builder
[INFO]    task-segment: [install]
[INFO] ------------------------------------------------------------------------
[INFO] [genesis:validate-configuration {execution: default}]
[INFO] [geronimo-property:set-property {execution: set-property}]
[INFO] snapshot org.apache.geronimo.modules:geronimo-webservices-builder:3.0-SNAPSHOT: checking
for updates from jetty.oss.sonatype.org
[INFO] snapshot org.apache.geronimo.modules:geronimo-webservices-builder:3.0-SNAPSHOT: checking
for updates from openqa-snapshots
[INFO] snapshot org.apache.geronimo.modules:geronimo-webservices-builder:3.0-SNAPSHOT: checking
for updates from codehaus.snapshots
[INFO] snapshot org.apache.geronimo.modules:geronimo-webservices-builder:3.0-SNAPSHOT: checking
for updates from apache.snapshots
[INFO] [enforcer:enforce {execution: default}]
[INFO] [xmlbeans:xmlbeans {execution: default}]
Time to build schema type system: 0.103 seconds
Time to generate code: 0.099 seconds
Time to compile code: 1.801 seconds
[INFO] [remote-resources:process {execution: default}]
[INFO] [resources:resources {execution: default-resources}]
[INFO] Using 'UTF-8' encoding to copy filtered resources.
[INFO] skip non existing resourceDirectory /home/geronimo/geronimo/trunk/plugins/openejb/geronimo-openejb-builder/src/main/resources
[INFO] skip non existing resourceDirectory /home/geronimo/geronimo/trunk/plugins/openejb/geronimo-openejb-builder/src/main/filtered-resources
[INFO] Copying 70 resources
[INFO] Copying 3 resources
[INFO] [compiler:compile {execution: default-compile}]
[INFO] Compiling 9 source files to /home/geronimo/geronimo/trunk/plugins/openejb/geronimo-openejb-builder/target/classes
[INFO] ------------------------------------------------------------------------
[ERROR] BUILD FAILURE
[INFO] ------------------------------------------------------------------------
[INFO] Compilation failure

/home/geronimo/geronimo/trunk/plugins/openejb/geronimo-openejb-builder/src/main/java/org/apache/geronimo/openejb/deployment/EjbDeploymentBuilder.java:[50,34]
cannot find symbol
symbol  : class SingletonDeploymentGBean
location: package org.apache.geronimo.openejb

/home/geronimo/geronimo/trunk/plugins/openejb/geronimo-openejb-builder/src/main/java/org/apache/geronimo/openejb/deployment/EjbDeploymentBuilder.java:[113,60]
cannot find symbol
symbol  : variable SingletonDeploymentGBean
location: class org.apache.geronimo.openejb.deployment.EjbDeploymentBuilder


[INFO] ------------------------------------------------------------------------
[INFO] Trace
org.apache.maven.BuildFailureException: Compilation failure
	at org.apache.maven.lifecycle.DefaultLifecycleExecutor.executeGoals(DefaultLifecycleExecutor.java:715)
	at org.apache.maven.lifecycle.DefaultLifecycleExecutor.executeGoalWithLifecycle(DefaultLifecycleExecutor.java:556)
	at org.apache.maven.lifecycle.DefaultLifecycleExecutor.executeGoal(DefaultLifecycleExecutor.java:535)
	at org.apache.maven.lifecycle.DefaultLifecycleExecutor.executeGoalAndHandleFailures(DefaultLifecycleExecutor.java:387)
	at org.apache.maven.lifecycle.DefaultLifecycleExecutor.executeTaskSegments(DefaultLifecycleExecutor.java:348)
	at org.apache.maven.lifecycle.DefaultLifecycleExecutor.execute(DefaultLifecycleExecutor.java:180)
	at org.apache.maven.DefaultMaven.doExecute(DefaultMaven.java:328)
	at org.apache.maven.DefaultMaven.execute(DefaultMaven.java:138)
	at org.apache.maven.cli.MavenCli.main(MavenCli.java:362)
	at org.apache.maven.cli.compat.CompatibleMain.main(CompatibleMain.java:60)
	at sun.reflect.NativeMethodAccessorImpl.invoke0(Native Method)
	at sun.reflect.NativeMethodAccessorImpl.invoke(NativeMethodAccessorImpl.java:39)
	at sun.reflect.DelegatingMethodAccessorImpl.invoke(DelegatingMethodAccessorImpl.java:25)
	at java.lang.reflect.Method.invoke(Method.java:597)
	at org.codehaus.classworlds.Launcher.launchEnhanced(Launcher.java:315)
	at org.codehaus.classworlds.Launcher.launch(Launcher.java:255)
	at org.codehaus.classworlds.Launcher.mainWithExitCode(Launcher.java:430)
	at org.codehaus.classworlds.Launcher.main(Launcher.java:375)
Caused by: org.apache.maven.plugin.CompilationFailureException: Compilation failure
	at org.apache.maven.plugin.AbstractCompilerMojo.execute(AbstractCompilerMojo.java:516)
	at org.apache.maven.plugin.CompilerMojo.execute(CompilerMojo.java:114)
	at org.apache.maven.plugin.DefaultPluginManager.executeMojo(DefaultPluginManager.java:490)
	at org.apache.maven.lifecycle.DefaultLifecycleExecutor.executeGoals(DefaultLifecycleExecutor.java:694)
	... 17 more
[INFO] ------------------------------------------------------------------------
[INFO] Total time: 29 minutes 43 seconds
[INFO] Finished at: Thu May 06 03:33:34 EDT 2010
[INFO] Final Memory: 278M/741M
[INFO] ------------------------------------------------------------------------

Mime
View raw message