geronimo-dev mailing list archives

Site index · List index
Message view « Date » · « Thread »
Top « Date » · « Thread »
From ga...@apache.org
Subject [BUILD] trunk: Failed for Revision: 941274
Date Wed, 05 May 2010 14:47:02 GMT
Geronimo Revision: 941274 built with tests included
 
See the full build-0900.log file at http://people.apache.org/builds/geronimo/server/binaries/trunk/20100505/build-0900.log
 
Download the binaries from http://people.apache.org/builds/geronimo/server/binaries/trunk/20100505
[INFO] BUILD SUCCESSFUL
[INFO] ------------------------------------------------------------------------
[INFO] Total time: 48 minutes 34 seconds
[INFO] Finished at: Wed May 05 09:53:11 EDT 2010
[INFO] Final Memory: 506M/1010M
[INFO] ------------------------------------------------------------------------
 
TESTSUITE RESULTS (Failures only)
=================================
 
Assembly: tomcat
=================================
See full test results and logs at http://people.apache.org/builds/geronimo/server/binaries/trunk/20100505/logs-0900-tomcat/
 
Running TestSuite
Tests run: 2, Failures: 1, Errors: 0, Skipped: 0, Time elapsed: 0.348 sec <<< FAILURE!
 
[INFO]     [0] org.apache.geronimo.testsuite/test-myfaces/3.0-SNAPSHOT/war
[INFO] [ianal:verify-legal-files {execution: default}]
[WARNING] Skipping verification of legal files in artifacts:
[WARNING]     org.apache.geronimo.testsuite:test-myfaces:war:3.0-SNAPSHOT
[INFO] [geronimo:stop-server {execution: stop-geronimo}]
[org.apache.geronimo.mavenplugins.geronimo.ServerProxy] : Initialized with URL: service:jmx:rmi://localhost/jndi/rmi://localhost:1099/JMXConnector,
environment: {jmx.remote.credentials=[Ljava.lang.String;@1897b6f}
[org.apache.geronimo.mavenplugins.geronimo.ServerProxy] : Connecting to: service:jmx:rmi://localhost/jndi/rmi://localhost:1099/JMXConnector
[org.apache.geronimo.mavenplugins.geronimo.ServerProxy] : Connected
[INFO] Stopping Geronimo server...
[INFO] [install:install {execution: default-install}]
[INFO] Installing /home/geronimo/geronimo/trunk/testsuite/web-testsuite/test-myfaces/target/test-myfaces-3.0-SNAPSHOT.war
to /home/geronimo/.m2/repository/org/apache/geronimo/testsuite/test-myfaces/3.0-SNAPSHOT/test-myfaces-3.0-SNAPSHOT.war
[INFO] [failsafe:verify {execution: verify}]
[INFO] Failsafe report directory: /home/geronimo/geronimo/trunk/testsuite/web-testsuite/test-myfaces/target/failsafe-reports
[INFO] ------------------------------------------------------------------------
[INFO] Building Geronimo TestSuite :: Web Testsuite :: Test Tomcat
[INFO]    task-segment: [install]
[INFO] ------------------------------------------------------------------------
[INFO] [genesis:validate-configuration {execution: default}]
[INFO] [geronimo-property:set-property {execution: set-property}]
[INFO] [enforcer:enforce {execution: default}]
[INFO] [remote-resources:process {execution: default}]
[INFO] [resources:resources {execution: default-resources}]
[INFO] Using 'UTF-8' encoding to copy filtered resources.
[INFO] skip non existing resourceDirectory /home/geronimo/geronimo/trunk/testsuite/web-testsuite/test-tomcat/src/main/resources
[INFO] skip non existing resourceDirectory /home/geronimo/geronimo/trunk/testsuite/web-testsuite/test-tomcat/src/main/filtered-resources
[INFO] Copying 3 resources
[INFO] [compiler:compile {execution: default-compile}]
[INFO] No sources to compile
[INFO] [resources:testResources {execution: default-testResources}]
[INFO] Using 'UTF-8' encoding to copy filtered resources.
[INFO] skip non existing resourceDirectory /home/geronimo/geronimo/trunk/testsuite/web-testsuite/test-tomcat/src/test/resources
[INFO] skip non existing resourceDirectory /home/geronimo/geronimo/trunk/testsuite/web-testsuite/test-tomcat/src/test/filtered-resources
[INFO] Copying 3 resources
[INFO] [compiler:testCompile {execution: default-testCompile}]
[INFO] Compiling 1 source file to /home/geronimo/geronimo/trunk/testsuite/web-testsuite/test-tomcat/target/test-classes
[INFO] [surefire:test {execution: default-test}]
[INFO] Tests are skipped.
[INFO] [war:war {execution: default-war}]
[INFO] Packaging webapp
[INFO] Assembling webapp[test-tomcat] in [/home/geronimo/geronimo/trunk/testsuite/web-testsuite/test-tomcat/target/test-tomcat-3.0-SNAPSHOT]
[INFO] Processing war project
[INFO] Copying webapp webResources[/home/geronimo/geronimo/trunk/testsuite/web-testsuite/test-tomcat/src/main/webapp]
to[/home/geronimo/geronimo/trunk/testsuite/web-testsuite/test-tomcat/target/test-tomcat-3.0-SNAPSHOT]
[INFO] Copying webapp webResources[/home/geronimo/geronimo/trunk/testsuite/web-testsuite/test-tomcat/target/classes]
to[/home/geronimo/geronimo/trunk/testsuite/web-testsuite/test-tomcat/target/test-tomcat-3.0-SNAPSHOT]
[INFO] Copying webapp resources[/home/geronimo/geronimo/trunk/testsuite/web-testsuite/test-tomcat/src/main/webapp]
[INFO] Building jar: /home/geronimo/geronimo/trunk/testsuite/web-testsuite/test-tomcat/target/test-tomcat-3.0-SNAPSHOT/WEB-INF/lib/test-tomcat-3.0-SNAPSHOT.jar
[INFO] Webapp assembled in[52 msecs]
[INFO] Building war: /home/geronimo/geronimo/trunk/testsuite/web-testsuite/test-tomcat/target/test-tomcat-3.0-SNAPSHOT.war
[INFO] [geronimo:start-server {execution: start-geronimo}]
[INFO] Using assembly configuration: tomcat
[INFO] Using assembly artifact: org.apache.geronimo.assemblies:geronimo-tomcat7-javaee6:zip:bin:3.0-SNAPSHOT:provided
[INFO] Using geronimoHome: /home/geronimo/geronimo/trunk/testsuite/web-testsuite/test-tomcat/target/geronimo-tomcat7-javaee6-3.0-SNAPSHOT
[INFO] Installing assembly...
[INFO] Expanding: /home/geronimo/.m2/repository/org/apache/geronimo/assemblies/geronimo-tomcat7-javaee6/3.0-SNAPSHOT/geronimo-tomcat7-javaee6-3.0-SNAPSHOT-bin.zip
into /home/geronimo/geronimo/trunk/testsuite/web-testsuite/test-tomcat/target
[INFO] Starting Geronimo server...
[INFO] Selected option set: default
[INFO] Redirecting output to: /home/geronimo/geronimo/trunk/testsuite/web-testsuite/test-tomcat/target/geronimo-logs/org.apache.geronimo.mavenplugins.geronimo.server.StartServerMojo.log
[INFO] Waiting for Geronimo server...
[org.apache.geronimo.mavenplugins.geronimo.ServerProxy] : Initialized with URL: service:jmx:rmi://localhost/jndi/rmi://localhost:1099/JMXConnector,
environment: {jmx.remote.credentials=[Ljava.lang.String;@122d9d0}
[org.apache.geronimo.mavenplugins.geronimo.ServerProxy] : Connecting to: service:jmx:rmi://localhost/jndi/rmi://localhost:1099/JMXConnector
[org.apache.geronimo.mavenplugins.geronimo.ServerProxy] : Connected
[INFO] Geronimo server started in 0:00:00.069
[INFO] [geronimo:deploy-module {execution: deploy-wars}]
[INFO] Using non-artifact based module archive: /home/geronimo/geronimo/trunk/testsuite/web-testsuite/test-tomcat/target/test-tomcat-3.0-SNAPSHOT.war
[INFO] Distributing module artifact: /home/geronimo/geronimo/trunk/testsuite/web-testsuite/test-tomcat/target/test-tomcat-3.0-SNAPSHOT.war
[org.apache.geronimo.deployment.plugin.factories.BaseDeploymentFactory] : Parsing URI=deployer:geronimo:jmx://localhost:1099
[org.apache.geronimo.deployment.plugin.factories.BaseDeploymentFactory] : Parsing URI=deployer:geronimo:jmx://localhost:1099
[org.apache.geronimo.deployment.plugin.factories.BaseDeploymentFactory] : Using protocol=jmx,
host=localhost, port=1099
[org.apache.geronimo.deployment.plugin.factories.BaseDeploymentFactory] : Using JMXServiceURL
with host=localhost, port=1099, secure=false
[WARNING] Ignoring failure !
[INFO] [failsafe:integration-test {execution: integration-test}]
[INFO] Failsafe report directory: /home/geronimo/geronimo/trunk/testsuite/web-testsuite/test-tomcat/target/failsafe-reports

-------------------------------------------------------
 T E S T S
-------------------------------------------------------
Running TestSuite
Tests run: 2, Failures: 1, Errors: 0, Skipped: 0, Time elapsed: 0.348 sec <<< FAILURE!

Results :

Failed tests: 
  testTomcatHost(org.apache.geronimo.testsuite.tomcat.TestTomcat)

Tests run: 2, Failures: 1, Errors: 0, Skipped: 0

[INFO] [geronimo:undeploy-module {execution: undeploy-war-as-moduleId}]
[INFO] Using non-artifact based module id: org.apache.geronimo.testsuite/test-tomcat/3.0-SNAPSHOT/war
[org.apache.geronimo.deployment.plugin.factories.BaseDeploymentFactory] : Parsing URI=deployer:geronimo:jmx://localhost:1099
[org.apache.geronimo.deployment.plugin.factories.BaseDeploymentFactory] : Parsing URI=deployer:geronimo:jmx://localhost:1099
[org.apache.geronimo.deployment.plugin.factories.BaseDeploymentFactory] : Using protocol=jmx,
host=localhost, port=1099
[org.apache.geronimo.deployment.plugin.factories.BaseDeploymentFactory] : Using JMXServiceURL
with host=localhost, port=1099, secure=false
[WARNING] Ignoring failure !
[INFO] [ianal:verify-legal-files {execution: default}]
[WARNING] Skipping verification of legal files in artifacts:
[WARNING]     org.apache.geronimo.testsuite:test-tomcat:war:3.0-SNAPSHOT
[INFO] [geronimo:stop-server {execution: stop-geronimo}]
[org.apache.geronimo.mavenplugins.geronimo.ServerProxy] : Initialized with URL: service:jmx:rmi://localhost/jndi/rmi://localhost:1099/JMXConnector,
environment: {jmx.remote.credentials=[Ljava.lang.String;@1ab2f1b}
[org.apache.geronimo.mavenplugins.geronimo.ServerProxy] : Connecting to: service:jmx:rmi://localhost/jndi/rmi://localhost:1099/JMXConnector
[org.apache.geronimo.mavenplugins.geronimo.ServerProxy] : Connection failure; ignoring: java.io.IOException:
Failed to retrieve RMIServer stub: javax.naming.NameNotFoundException: JMXConnector
[INFO] ------------------------------------------------------------------------
[ERROR] BUILD ERROR
 
Assembly: jetty
=================================
See full test results and logs at http://people.apache.org/builds/geronimo/server/binaries/trunk/20100505/logs-0900-jetty/
 
 
Samples: trunk
=================================
Log: http://people.apache.org/builds/geronimo/server/binaries/trunk/20100505/samples-0900.log
 
Build status: FAILED
 

Mime
View raw message