geronimo-dev mailing list archives

Site index · List index
Message view « Date » · « Thread »
Top « Date » · « Thread »
From Ivan <xhh...@gmail.com>
Subject Re: [BUILD] branches/2.1: Failed for Revision: 931024
Date Tue, 06 Apr 2010 06:20:14 GMT
add a depdency for portlet-api, should be ok now.

2010/4/6 <gawor@apache.org>

> Geronimo Revision: 931024 built with tests included
>
> See the full build-0200.log file at
> http://people.apache.org/builds/geronimo/server/binaries/2.1/20100406/build-0200.log
>
>
> See the unit test reports at
> http://people.apache.org/builds/geronimo/server/binaries/2.1/20100406/unit-test-reports
>
>
> [INFO] [resources:testResources]
> [INFO] Using 'UTF-8' encoding to copy filtered resources.
> [INFO] skip non existing resourceDirectory
> /home/geronimo/geronimo/2.1/plugins/console/console-filter/src/test/resources
> [INFO] skip non existing resourceDirectory
> /home/geronimo/geronimo/2.1/plugins/console/console-filter/src/test/filtered-resources
> [INFO] Copying 3 resources
> [INFO] [compiler:testCompile]
> [INFO] No sources to compile
> [INFO] [surefire:test]
> [INFO] Surefire report directory:
> /home/geronimo/geronimo/2.1/plugins/console/console-filter/target/surefire-reports
>
> -------------------------------------------------------
>  T E S T S
> -------------------------------------------------------
> There are no tests to run.
>
> Results :
>
> Tests run: 0, Failures: 0, Errors: 0, Skipped: 0
>
> [INFO] [jar:jar]
> [INFO] Building jar:
> /home/geronimo/geronimo/2.1/plugins/console/console-filter/target/console-filter-2.1.5-SNAPSHOT.jar
> [INFO] [ianal:verify-legal-files {execution: default}]
> [INFO] Checking legal files in: console-filter-2.1.5-SNAPSHOT.jar
> [INFO] [install:install]
> [INFO] Installing
> /home/geronimo/geronimo/2.1/plugins/console/console-filter/target/console-filter-2.1.5-SNAPSHOT.jar
> to
> /home/geronimo/.m2/repository/org/apache/geronimo/plugins/console-filter/2.1.5-SNAPSHOT/console-filter-2.1.5-SNAPSHOT.jar
> [INFO]
> ------------------------------------------------------------------------
> [INFO] Building Geronimo Plugins, Pluto
> [INFO]    task-segment: [install]
> [INFO]
> ------------------------------------------------------------------------
> [INFO] [genesis:validate-configuration {execution: default}]
> [INFO] [enforcer:enforce {execution: default}]
> [INFO] [remote-resources:process {execution: default}]
> [INFO] [site:attach-descriptor]
> [INFO] [ianal:verify-legal-files {execution: default}]
> [INFO] [install:install]
> [INFO] Installing /home/geronimo/geronimo/2.1/plugins/pluto/pom.xml to
> /home/geronimo/.m2/repository/org/apache/geronimo/plugins/pluto/2.1.5-SNAPSHOT/pluto-2.1.5-SNAPSHOT.pom
> [INFO]
> ------------------------------------------------------------------------
> [INFO] Building Geronimo Plugins, Pluto :: Core
> [INFO]    task-segment: [install]
> [INFO]
> ------------------------------------------------------------------------
> [INFO] [genesis:validate-configuration {execution: default}]
> [INFO] [enforcer:enforce {execution: default}]
> [INFO] [remote-resources:process {execution: default}]
> [INFO] [resources:resources]
> [INFO] Using 'UTF-8' encoding to copy filtered resources.
> [INFO] Copying 1 resource
> [INFO] skip non existing resourceDirectory
> /home/geronimo/geronimo/2.1/plugins/pluto/geronimo-pluto/src/main/filtered-resources
> [INFO] Copying 3 resources
> [INFO] [compiler:compile]
> [INFO] Compiling 4 source files to
> /home/geronimo/geronimo/2.1/plugins/pluto/geronimo-pluto/target/classes
> [INFO]
> ------------------------------------------------------------------------
> [ERROR] BUILD FAILURE
> [INFO]
> ------------------------------------------------------------------------
> [INFO] Compilation failure
>
> /home/geronimo/geronimo/2.1/plugins/pluto/geronimo-pluto/src/main/java/org/apache/geronimo/pluto/impl/PortalURLParserImpl.java:[28,21]
> package javax.portlet does not exist
>
> /home/geronimo/geronimo/2.1/plugins/pluto/geronimo-pluto/src/main/java/org/apache/geronimo/pluto/impl/PortalURLParserImpl.java:[29,21]
> package javax.portlet does not exist
>
> /home/geronimo/geronimo/2.1/plugins/pluto/geronimo-pluto/src/main/java/org/apache/geronimo/pluto/impl/PortalURLParserImpl.java:[186,57]
> cannot find symbol
> symbol  : class WindowState
> location: class org.apache.geronimo.pluto.impl.PortalURLParserImpl
>
> /home/geronimo/geronimo/2.1/plugins/pluto/geronimo-pluto/src/main/java/org/apache/geronimo/pluto/impl/PortalURLParserImpl.java:[191,57]
> cannot find symbol
> symbol  : class PortletMode
> location: class org.apache.geronimo.pluto.impl.PortalURLParserImpl
>
>
> [INFO]
> ------------------------------------------------------------------------
> [INFO] Trace
> org.apache.maven.BuildFailureException: Compilation failure
>        at
> org.apache.maven.lifecycle.DefaultLifecycleExecutor.executeGoals(DefaultLifecycleExecutor.java:579)
>        at
> org.apache.maven.lifecycle.DefaultLifecycleExecutor.executeGoalWithLifecycle(DefaultLifecycleExecutor.java:499)
>        at
> org.apache.maven.lifecycle.DefaultLifecycleExecutor.executeGoal(DefaultLifecycleExecutor.java:478)
>        at
> org.apache.maven.lifecycle.DefaultLifecycleExecutor.executeGoalAndHandleFailures(DefaultLifecycleExecutor.java:330)
>        at
> org.apache.maven.lifecycle.DefaultLifecycleExecutor.executeTaskSegments(DefaultLifecycleExecutor.java:291)
>        at
> org.apache.maven.lifecycle.DefaultLifecycleExecutor.execute(DefaultLifecycleExecutor.java:142)
>        at org.apache.maven.DefaultMaven.doExecute(DefaultMaven.java:336)
>        at org.apache.maven.DefaultMaven.execute(DefaultMaven.java:129)
>        at org.apache.maven.cli.MavenCli.main(MavenCli.java:287)
>        at sun.reflect.NativeMethodAccessorImpl.invoke0(Native Method)
>        at
> sun.reflect.NativeMethodAccessorImpl.invoke(NativeMethodAccessorImpl.java:39)
>        at
> sun.reflect.DelegatingMethodAccessorImpl.invoke(DelegatingMethodAccessorImpl.java:25)
>        at java.lang.reflect.Method.invoke(Method.java:585)
>        at
> org.codehaus.classworlds.Launcher.launchEnhanced(Launcher.java:315)
>        at org.codehaus.classworlds.Launcher.launch(Launcher.java:255)
>        at
> org.codehaus.classworlds.Launcher.mainWithExitCode(Launcher.java:430)
>        at org.codehaus.classworlds.Launcher.main(Launcher.java:375)
> Caused by: org.apache.maven.plugin.CompilationFailureException: Compilation
> failure
>        at
> org.apache.maven.plugin.AbstractCompilerMojo.execute(AbstractCompilerMojo.java:516)
>        at
> org.apache.maven.plugin.CompilerMojo.execute(CompilerMojo.java:114)
>        at
> org.apache.maven.plugin.DefaultPluginManager.executeMojo(DefaultPluginManager.java:451)
>        at
> org.apache.maven.lifecycle.DefaultLifecycleExecutor.executeGoals(DefaultLifecycleExecutor.java:558)
>        ... 16 more
> [INFO]
> ------------------------------------------------------------------------
> [INFO] Total time: 13 minutes 49 seconds
> [INFO] Finished at: Tue Apr 06 02:18:09 EDT 2010
> [INFO] Final Memory: 249M/559M
> [INFO]
> ------------------------------------------------------------------------
>



-- 
Ivan

Mime
View raw message