geronimo-dev mailing list archives

Site index · List index
Message view « Date » · « Thread »
Top « Date » · « Thread »
From ga...@apache.org
Subject [BUILD] trunk: Failed for Revision: 931139
Date Tue, 06 Apr 2010 13:36:23 GMT
Geronimo Revision: 931139 built with tests included
 
See the full build-0900.log file at http://people.apache.org/builds/geronimo/server/binaries/trunk/20100406/build-0900.log
 
 
See the unit test reports at http://people.apache.org/builds/geronimo/server/binaries/trunk/20100406/unit-test-reports
 
[INFO] snapshot org.apache.openejb:container:3.1.3-SNAPSHOT: checking for updates from ops4j.snapshots
[INFO] snapshot org.apache.openejb:container:3.1.3-SNAPSHOT: checking for updates from jetty.oss.sonatype.org
[INFO] snapshot org.apache.openejb:container:3.1.3-SNAPSHOT: checking for updates from openqa-snapshots
[INFO] snapshot org.apache.openejb:container:3.1.3-SNAPSHOT: checking for updates from codehaus.snapshots
[INFO] snapshot org.apache.openejb:container:3.1.3-SNAPSHOT: checking for updates from apache.snapshots
Downloading: http://repository.apache.org/snapshots/org/apache/openejb/container/3.1.3-SNAPSHOT/container-3.1.3-20100321.222835-16.pom
1K downloaded  (container-3.1.3-20100321.222835-16.pom)
[INFO] snapshot org.apache.openejb:openejb:3.1.3-SNAPSHOT: checking for updates from ops4j.snapshots
[INFO] snapshot org.apache.openejb:openejb:3.1.3-SNAPSHOT: checking for updates from jetty.oss.sonatype.org
[INFO] snapshot org.apache.openejb:openejb:3.1.3-SNAPSHOT: checking for updates from openqa-snapshots
[INFO] snapshot org.apache.openejb:openejb:3.1.3-SNAPSHOT: checking for updates from codehaus.snapshots
[INFO] snapshot org.apache.openejb:openejb:3.1.3-SNAPSHOT: checking for updates from apache.snapshots
Downloading: http://repository.apache.org/snapshots/org/apache/openejb/openejb/3.1.3-SNAPSHOT/openejb-3.1.3-20100321.222835-19.pom
30K downloaded  (openejb-3.1.3-20100321.222835-19.pom)
Downloading: http://oss.sonatype.org/content/repositories/jetty//org/apache/geronimo/specs/geronimo-jms_1.1_spec/1.1.1/geronimo-jms_1.1_spec-1.1.1.pom
[INFO] Unable to find resource 'org.apache.geronimo.specs:geronimo-jms_1.1_spec:pom:1.1.1'
in repository jetty.oss.sonatype.org (http://oss.sonatype.org/content/repositories/jetty/)
Downloading: http://svn.apache.org/repos/asf/servicemix/m2-repo//org/apache/geronimo/specs/geronimo-jms_1.1_spec/1.1.1/geronimo-jms_1.1_spec-1.1.1.pom
[INFO] Unable to find resource 'org.apache.geronimo.specs:geronimo-jms_1.1_spec:pom:1.1.1'
in repository smx.svn (http://svn.apache.org/repos/asf/servicemix/m2-repo/)
Downloading: http://download.java.net/maven/1//org.apache.geronimo.specs/poms/geronimo-jms_1.1_spec-1.1.1.pom
[INFO] Unable to find resource 'org.apache.geronimo.specs:geronimo-jms_1.1_spec:pom:1.1.1'
in repository java.net (http://download.java.net/maven/1/)
Downloading: http://nexus.openqa.org/content/repositories/releases/org/apache/geronimo/specs/geronimo-jms_1.1_spec/1.1.1/geronimo-jms_1.1_spec-1.1.1.pom
[INFO] Unable to find resource 'org.apache.geronimo.specs:geronimo-jms_1.1_spec:pom:1.1.1'
in repository openqa-releases (http://nexus.openqa.org/content/repositories/releases)
Downloading: http://maven.rtp.raleigh.ibm.com/nexus-proxy//org/apache/geronimo/specs/geronimo-jms_1.1_spec/1.1.1/geronimo-jms_1.1_spec-1.1.1.pom
2K downloaded  (geronimo-jms_1.1_spec-1.1.1.pom)
[INFO] snapshot org.apache.geronimo.modules:geronimo-connector-1_6:3.0-SNAPSHOT: checking
for updates from ops4j.snapshots
Downloading: http://repository.apache.org/snapshots/org/apache/openejb/openejb-jee/3.1.3-SNAPSHOT/openejb-jee-3.1.3-20100321.222835-16.jar
Downloading: http://oss.sonatype.org/content/repositories/jetty//org/apache/geronimo/specs/geronimo-jms_1.1_spec/1.1.1/geronimo-jms_1.1_spec-1.1.1.jar
[INFO] Unable to find resource 'org.apache.geronimo.specs:geronimo-jms_1.1_spec:jar:1.1.1'
in repository jetty.oss.sonatype.org (http://oss.sonatype.org/content/repositories/jetty/)
Downloading: http://svn.apache.org/repos/asf/servicemix/m2-repo//org/apache/geronimo/specs/geronimo-jms_1.1_spec/1.1.1/geronimo-jms_1.1_spec-1.1.1.jar
[INFO] snapshot org.apache.geronimo.modules:geronimo-connector-1_6:3.0-SNAPSHOT: checking
for updates from jetty.oss.sonatype.org
[INFO] snapshot org.apache.geronimo.modules:geronimo-connector-1_6:3.0-SNAPSHOT: checking
for updates from openqa-snapshots
[INFO] Unable to find resource 'org.apache.geronimo.specs:geronimo-jms_1.1_spec:jar:1.1.1'
in repository smx.svn (http://svn.apache.org/repos/asf/servicemix/m2-repo/)
Downloading: http://download.java.net/maven/1//org.apache.geronimo.specs/jars/geronimo-jms_1.1_spec-1.1.1.jar
[INFO] snapshot org.apache.geronimo.modules:geronimo-connector-1_6:3.0-SNAPSHOT: checking
for updates from codehaus.snapshots
[INFO] snapshot org.apache.geronimo.modules:geronimo-connector-1_6:3.0-SNAPSHOT: checking
for updates from apache.snapshots
[INFO] Unable to find resource 'org.apache.geronimo.specs:geronimo-jms_1.1_spec:jar:1.1.1'
in repository java.net (http://download.java.net/maven/1/)
Downloading: http://nexus.openqa.org/content/repositories/releases/org/apache/geronimo/specs/geronimo-jms_1.1_spec/1.1.1/geronimo-jms_1.1_spec-1.1.1.jar
[INFO] Unable to find resource 'org.apache.geronimo.specs:geronimo-jms_1.1_spec:jar:1.1.1'
in repository openqa-releases (http://nexus.openqa.org/content/repositories/releases)
Downloading: http://maven.rtp.raleigh.ibm.com/nexus-proxy//org/apache/geronimo/specs/geronimo-jms_1.1_spec/1.1.1/geronimo-jms_1.1_spec-1.1.1.jar
31K downloaded  (geronimo-jms_1.1_spec-1.1.1.jar)
938K downloaded  (openejb-jee-3.1.3-20100321.222835-16.jar)
[INFO] [enforcer:enforce {execution: default}]
[INFO] [xmlbeans:xmlbeans {execution: default}]
Time to build schema type system: 0.105 seconds
Time to generate code: 0.128 seconds
Time to compile code: 1.808 seconds
[INFO] [remote-resources:process {execution: default}]
[INFO] [resources:resources {execution: default-resources}]
[INFO] Using 'UTF-8' encoding to copy filtered resources.
[INFO] skip non existing resourceDirectory /home/geronimo/geronimo/trunk/plugins/connector-1_6/geronimo-connector-builder-1_6/src/main/resources
[INFO] skip non existing resourceDirectory /home/geronimo/geronimo/trunk/plugins/connector-1_6/geronimo-connector-builder-1_6/src/main/filtered-resources
[INFO] Copying 130 resources
[INFO] Copying 3 resources
[INFO] [compiler:compile {execution: default-compile}]
[INFO] Compiling 31 source files to /home/geronimo/geronimo/trunk/plugins/connector-1_6/geronimo-connector-builder-1_6/target/classes
[INFO] ------------------------------------------------------------------------
[ERROR] BUILD FAILURE
[INFO] ------------------------------------------------------------------------
[INFO] Compilation failure
/home/geronimo/geronimo/trunk/plugins/connector-1_6/geronimo-connector-builder-1_6/src/main/java/org/apache/geronimo/connector/deployment/ConnectorModuleBuilder.java:[656,76]
incomparable types: boolean and <nulltype>


[INFO] ------------------------------------------------------------------------
[INFO] Trace
org.apache.maven.BuildFailureException: Compilation failure
/home/geronimo/geronimo/trunk/plugins/connector-1_6/geronimo-connector-builder-1_6/src/main/java/org/apache/geronimo/connector/deployment/ConnectorModuleBuilder.java:[656,76]
incomparable types: boolean and <nulltype>


	at org.apache.maven.lifecycle.DefaultLifecycleExecutor.executeGoals(DefaultLifecycleExecutor.java:715)
	at org.apache.maven.lifecycle.DefaultLifecycleExecutor.executeGoalWithLifecycle(DefaultLifecycleExecutor.java:556)
	at org.apache.maven.lifecycle.DefaultLifecycleExecutor.executeGoal(DefaultLifecycleExecutor.java:535)
	at org.apache.maven.lifecycle.DefaultLifecycleExecutor.executeGoalAndHandleFailures(DefaultLifecycleExecutor.java:387)
	at org.apache.maven.lifecycle.DefaultLifecycleExecutor.executeTaskSegments(DefaultLifecycleExecutor.java:348)
	at org.apache.maven.lifecycle.DefaultLifecycleExecutor.execute(DefaultLifecycleExecutor.java:180)
	at org.apache.maven.DefaultMaven.doExecute(DefaultMaven.java:328)
	at org.apache.maven.DefaultMaven.execute(DefaultMaven.java:138)
	at org.apache.maven.cli.MavenCli.main(MavenCli.java:362)
	at org.apache.maven.cli.compat.CompatibleMain.main(CompatibleMain.java:60)
	at sun.reflect.NativeMethodAccessorImpl.invoke0(Native Method)
	at sun.reflect.NativeMethodAccessorImpl.invoke(NativeMethodAccessorImpl.java:39)
	at sun.reflect.DelegatingMethodAccessorImpl.invoke(DelegatingMethodAccessorImpl.java:25)
	at java.lang.reflect.Method.invoke(Method.java:597)
	at org.codehaus.classworlds.Launcher.launchEnhanced(Launcher.java:315)
	at org.codehaus.classworlds.Launcher.launch(Launcher.java:255)
	at org.codehaus.classworlds.Launcher.mainWithExitCode(Launcher.java:430)
	at org.codehaus.classworlds.Launcher.main(Launcher.java:375)
Caused by: org.apache.maven.plugin.CompilationFailureException: Compilation failure
/home/geronimo/geronimo/trunk/plugins/connector-1_6/geronimo-connector-builder-1_6/src/main/java/org/apache/geronimo/connector/deployment/ConnectorModuleBuilder.java:[656,76]
incomparable types: boolean and <nulltype>


	at org.apache.maven.plugin.AbstractCompilerMojo.execute(AbstractCompilerMojo.java:516)
	at org.apache.maven.plugin.CompilerMojo.execute(CompilerMojo.java:114)
	at org.apache.maven.plugin.DefaultPluginManager.executeMojo(DefaultPluginManager.java:490)
	at org.apache.maven.lifecycle.DefaultLifecycleExecutor.executeGoals(DefaultLifecycleExecutor.java:694)
	... 17 more
[INFO] ------------------------------------------------------------------------
[INFO] Total time: 22 minutes 7 seconds
[INFO] Finished at: Tue Apr 06 09:27:16 EDT 2010
[INFO] Final Memory: 462M/663M
[INFO] ------------------------------------------------------------------------

Mime
View raw message