geronimo-dev mailing list archives

Site index · List index
Message view « Date » · « Thread »
Top « Date » · « Thread »
From ga...@apache.org
Subject [BUILD] branches/2.2: Failed for Revision: 930546
Date Sat, 03 Apr 2010 17:53:20 GMT
Geronimo Revision: 930546 built with tests included
 
See the full build-1400.log file at http://people.apache.org/builds/geronimo/server/binaries/2.2/20100403/build-1400.log
 
 
See the unit test reports at http://people.apache.org/builds/geronimo/server/binaries/2.2/20100403/unit-test-reports
 
[INFO] Using 'UTF-8' encoding to copy filtered resources.
[INFO] Copying 13 resources
[INFO] skip non existing resourceDirectory /home/geronimo/geronimo/2.2/plugins/tomcat/geronimo-tomcat6/src/test/filtered-resources
[INFO] Copying 3 resources
[INFO] [compiler:testCompile]
[INFO] Compiling 9 source files to /home/geronimo/geronimo/2.2/plugins/tomcat/geronimo-tomcat6/target/test-classes
[INFO] [surefire:test]
[INFO] Surefire report directory: /home/geronimo/geronimo/2.2/plugins/tomcat/geronimo-tomcat6/target/surefire-reports

-------------------------------------------------------
 T E S T S
-------------------------------------------------------
Running org.apache.geronimo.tomcat.StatTest
Tests run: 1, Failures: 0, Errors: 0, Skipped: 0, Time elapsed: 6.26 sec
Running org.apache.geronimo.tomcat.TomcatServerGBeanTest
Tests run: 3, Failures: 0, Errors: 0, Skipped: 0, Time elapsed: 4.635 sec
Running org.apache.geronimo.tomcat.JACCSecurityTest
Tests run: 1, Failures: 0, Errors: 0, Skipped: 0, Time elapsed: 4.099 sec
Running org.apache.geronimo.tomcat.ContainerTest
Tests run: 1, Failures: 0, Errors: 0, Skipped: 0, Time elapsed: 2.798 sec
Running org.apache.geronimo.tomcat.ApplicationTest
Tests run: 1, Failures: 0, Errors: 0, Skipped: 0, Time elapsed: 3.716 sec
Running org.apache.geronimo.tomcat.BasicTest
Tests run: 1, Failures: 0, Errors: 0, Skipped: 0, Time elapsed: 0.27 sec
Running org.apache.geronimo.tomcat.JAASSecurityTest
Tests run: 1, Failures: 0, Errors: 0, Skipped: 0, Time elapsed: 2.627 sec

Results :

Tests run: 9, Failures: 0, Errors: 0, Skipped: 0

[INFO] [jar:jar]
[INFO] Building jar: /home/geronimo/geronimo/2.2/plugins/tomcat/geronimo-tomcat6/target/geronimo-tomcat6-2.2.1-SNAPSHOT.jar
[INFO] [ianal:verify-legal-files {execution: default}]
[INFO] Checking legal files in: geronimo-tomcat6-2.2.1-SNAPSHOT.jar
[INFO] [install:install]
[INFO] Installing /home/geronimo/geronimo/2.2/plugins/tomcat/geronimo-tomcat6/target/geronimo-tomcat6-2.2.1-SNAPSHOT.jar
to /home/geronimo/.m2/repository/org/apache/geronimo/modules/geronimo-tomcat6/2.2.1-SNAPSHOT/geronimo-tomcat6-2.2.1-SNAPSHOT.jar
[INFO] ------------------------------------------------------------------------
[INFO] Building Geronimo Plugins, Tomcat :: Tomcat
[INFO]    task-segment: [install]
[INFO] ------------------------------------------------------------------------
[INFO] [genesis:validate-configuration {execution: default}]
[INFO] [enforcer:enforce {execution: default}]
[INFO] [remote-resources:process {execution: default}]
[INFO] [resources:resources]
[INFO] Using 'UTF-8' encoding to copy filtered resources.
[INFO] Copying 5 resources
[INFO] Copying 3 resources
[INFO] Copying 3 resources
[INFO] [car:validate-configuration]
[INFO] [car:prepare-plan]
[INFO] Generated: /home/geronimo/geronimo/2.2/plugins/tomcat/tomcat6/target/work/plan.xml
[INFO] [car:verify-no-dependency-change]
[INFO] ------------------------------------------------------------------------
[ERROR] BUILD FAILURE
[INFO] ------------------------------------------------------------------------
[INFO] Dependencies have changed:
	Added dependencies are saved here: /home/geronimo/geronimo/2.2/plugins/tomcat/tomcat6/src/main/history/dependencies.added.xml
	Removed dependencies are saved here: /home/geronimo/geronimo/2.2/plugins/tomcat/tomcat6/src/main/history/dependencies.removed.xml
	Tree listing is saved here: /home/geronimo/geronimo/2.2/plugins/tomcat/tomcat6/src/main/history/treeListing.txt
Delete /home/geronimo/geronimo/2.2/plugins/tomcat/tomcat6/src/main/history/dependencies.xml
if you are happy with the dependency changes.
[INFO] ------------------------------------------------------------------------
[INFO] Trace
org.apache.maven.BuildFailureException: Dependencies have changed:
	Added dependencies are saved here: /home/geronimo/geronimo/2.2/plugins/tomcat/tomcat6/src/main/history/dependencies.added.xml
	Removed dependencies are saved here: /home/geronimo/geronimo/2.2/plugins/tomcat/tomcat6/src/main/history/dependencies.removed.xml
	Tree listing is saved here: /home/geronimo/geronimo/2.2/plugins/tomcat/tomcat6/src/main/history/treeListing.txt
Delete /home/geronimo/geronimo/2.2/plugins/tomcat/tomcat6/src/main/history/dependencies.xml
if you are happy with the dependency changes.
	at org.apache.maven.lifecycle.DefaultLifecycleExecutor.executeGoals(DefaultLifecycleExecutor.java:580)
	at org.apache.maven.lifecycle.DefaultLifecycleExecutor.executeGoalWithLifecycle(DefaultLifecycleExecutor.java:500)
	at org.apache.maven.lifecycle.DefaultLifecycleExecutor.executeGoal(DefaultLifecycleExecutor.java:479)
	at org.apache.maven.lifecycle.DefaultLifecycleExecutor.executeGoalAndHandleFailures(DefaultLifecycleExecutor.java:331)
	at org.apache.maven.lifecycle.DefaultLifecycleExecutor.executeTaskSegments(DefaultLifecycleExecutor.java:292)
	at org.apache.maven.lifecycle.DefaultLifecycleExecutor.execute(DefaultLifecycleExecutor.java:142)
	at org.apache.maven.DefaultMaven.doExecute(DefaultMaven.java:336)
	at org.apache.maven.DefaultMaven.execute(DefaultMaven.java:129)
	at org.apache.maven.cli.MavenCli.main(MavenCli.java:301)
	at sun.reflect.NativeMethodAccessorImpl.invoke0(Native Method)
	at sun.reflect.NativeMethodAccessorImpl.invoke(NativeMethodAccessorImpl.java:39)
	at sun.reflect.DelegatingMethodAccessorImpl.invoke(DelegatingMethodAccessorImpl.java:25)
	at java.lang.reflect.Method.invoke(Method.java:585)
	at org.codehaus.classworlds.Launcher.launchEnhanced(Launcher.java:315)
	at org.codehaus.classworlds.Launcher.launch(Launcher.java:255)
	at org.codehaus.classworlds.Launcher.mainWithExitCode(Launcher.java:430)
	at org.codehaus.classworlds.Launcher.main(Launcher.java:375)
Caused by: org.apache.maven.plugin.MojoFailureException: Dependencies have changed:
	Added dependencies are saved here: /home/geronimo/geronimo/2.2/plugins/tomcat/tomcat6/src/main/history/dependencies.added.xml
	Removed dependencies are saved here: /home/geronimo/geronimo/2.2/plugins/tomcat/tomcat6/src/main/history/dependencies.removed.xml
	Tree listing is saved here: /home/geronimo/geronimo/2.2/plugins/tomcat/tomcat6/src/main/history/treeListing.txt
Delete /home/geronimo/geronimo/2.2/plugins/tomcat/tomcat6/src/main/history/dependencies.xml
if you are happy with the dependency changes.
	at org.apache.geronimo.mavenplugins.car.DependencyChangeMojo.saveDependencyChanges(DependencyChangeMojo.java:155)
	at org.apache.geronimo.mavenplugins.car.DependencyChangeMojo.execute(DependencyChangeMojo.java:114)
	at org.apache.maven.plugin.DefaultPluginManager.executeMojo(DefaultPluginManager.java:453)
	at org.apache.maven.lifecycle.DefaultLifecycleExecutor.executeGoals(DefaultLifecycleExecutor.java:559)
	... 16 more
[INFO] ------------------------------------------------------------------------
[INFO] Total time: 13 minutes 47 seconds
[INFO] Finished at: Sat Apr 03 14:16:40 EDT 2010
[INFO] Final Memory: 280M/562M
[INFO] ------------------------------------------------------------------------

Mime
View raw message