geronimo-dev mailing list archives

Site index · List index
Message view « Date » · « Thread »
Top « Date » · « Thread »
From Shawn Jiang <genspr...@gmail.com>
Subject Re: [BUILD] branches/2.2: Failed for Revision: 921648
Date Thu, 11 Mar 2010 09:04:50 GMT
On Thu, Mar 11, 2010 at 9:10 AM, <gawor@apache.org> wrote:

> Geronimo Revision: 921648 built with tests included
>
> See the full build-2000.log file at
> http://people.apache.org/builds/geronimo/server/binaries/2.2/20100310/build-2000.log
>
>
> See the unit test reports at
> http://people.apache.org/builds/geronimo/server/binaries/2.2/20100310/unit-test-reports
>
> [INFO] [resources:resources]
> [INFO] Using 'UTF-8' encoding to copy filtered resources.
> [INFO] skip non existing resourceDirectory
> /home/geronimo/geronimo/2.2/plugins/myfaces/myfaces-deployer/src/main/resources
> [INFO] skip non existing resourceDirectory
> /home/geronimo/geronimo/2.2/plugins/myfaces/myfaces-deployer/src/main/filtered-resources
> [INFO] Copying 3 resources
> [INFO] [car:validate-configuration]
> [INFO] [car:prepare-plan]
> [WARNING] Component returned which is not the same manager. Ignored.
> component=org.apache.maven.profiles.activation.AlwaysOnProfileActivator@9c009c0
> [WARNING] Component returned which is not the same manager. Ignored.
> component=org.apache.maven.profiles.activation.FileProfileActivator@12fe12fe
> [WARNING] Component returned which is not the same manager. Ignored.
> component=org.apache.maven.profiles.activation.OperatingSystemProfileActivator@9c009c0
> [INFO] Generated:
> /home/geronimo/geronimo/2.2/plugins/myfaces/myfaces-deployer/target/work/plan.xml
> [INFO] [car:verify-no-dependency-change]
> [WARNING] Component returned which is not the same manager. Ignored.
> component=org.apache.maven.profiles.activation.AlwaysOnProfileActivator@9c009c0
> [WARNING] Component returned which is not the same manager. Ignored.
> component=org.apache.maven.profiles.activation.FileProfileActivator@12fe12fe
> [WARNING] Component returned which is not the same manager. Ignored.
> component=org.apache.maven.profiles.activation.OperatingSystemProfileActivator@9c009c0
> [INFO] [car:package]
> [WARNING] Component returned which is not the same manager. Ignored.
> component=org.apache.maven.profiles.activation.AlwaysOnProfileActivator@9c009c0
> [WARNING] Component returned which is not the same manager. Ignored.
> component=org.apache.maven.profiles.activation.FileProfileActivator@12fe12fe
> [WARNING] Component returned which is not the same manager. Ignored.
> component=org.apache.maven.profiles.activation.OperatingSystemProfileActivator@9c009c0
> [INFO] Packaging module configuration:
> /home/geronimo/geronimo/2.2/plugins/myfaces/myfaces-deployer/target/work/plan.xml
> [INFO] Started deployer:
> org.apache.geronimo.framework/geronimo-gbean-deployer/2.2.1-SNAPSHOT/car
> [INFO] [car:prepare-metadata]
> [WARNING] Component returned which is not the same manager. Ignored.
> component=org.apache.maven.profiles.activation.AlwaysOnProfileActivator@9c009c0
> [WARNING] Component returned which is not the same manager. Ignored.
> component=org.apache.maven.profiles.activation.FileProfileActivator@12fe12fe
> [WARNING] Component returned which is not the same manager. Ignored.
> component=org.apache.maven.profiles.activation.OperatingSystemProfileActivator@9c009c0
> [INFO] [car:archive-car]
> [WARNING] Component returned which is not the same manager. Ignored.
> component=org.apache.maven.profiles.activation.AlwaysOnProfileActivator@9c009c0
> [WARNING] Component returned which is not the same manager. Ignored.
> component=org.apache.maven.profiles.activation.FileProfileActivator@12fe12fe
> [WARNING] Component returned which is not the same manager. Ignored.
> component=org.apache.maven.profiles.activation.OperatingSystemProfileActivator@9c009c0
> [INFO] Building jar:
> /home/geronimo/geronimo/2.2/plugins/myfaces/myfaces-deployer/target/myfaces-deployer-2.2.1-SNAPSHOT.car
> [INFO] [ianal:verify-legal-files {execution: default}]
> [INFO] Checking legal files in: myfaces-deployer-2.2.1-SNAPSHOT.car
> [INFO] [install:install]
> [INFO] Installing
> /home/geronimo/geronimo/2.2/plugins/myfaces/myfaces-deployer/target/myfaces-deployer-2.2.1-SNAPSHOT.car
> to
> /home/geronimo/.m2/repository/org/apache/geronimo/configs/myfaces-deployer/2.2.1-SNAPSHOT/myfaces-deployer-2.2.1-SNAPSHOT.car
> [INFO] [car:update-pluginlist]
> [INFO]
> ------------------------------------------------------------------------
> [INFO] Building Geronimo Plugins, OpenEJB :: Clustering over WADI
> [INFO]    task-segment: [install]
> [INFO]
> ------------------------------------------------------------------------
> [INFO] [genesis:validate-configuration {execution: default}]
> [INFO] [enforcer:enforce {execution: default}]
> [INFO] [remote-resources:process {execution: default}]
> [WARNING] org.apache.velocity.runtime.exception.ReferenceException:
> reference : template = META-INF/DEPENDENCIES.vm [line 40,column 14] : $
> license.name is not a valid reference.
> [WARNING] org.apache.velocity.runtime.exception.ReferenceException:
> reference : template = META-INF/DEPENDENCIES.vm [line 40,column 14] : $
> license.name is not a valid reference.
> [INFO] [resources:resources]
> [INFO] Using 'UTF-8' encoding to copy filtered resources.
> [INFO] Copying 1 resource
> [INFO] skip non existing resourceDirectory
> /home/geronimo/geronimo/2.2/plugins/openejb/geronimo-openejb-clustering-wadi/src/main/filtered-resources
> [INFO] Copying 3 resources
> [INFO] [compiler:compile]
> [INFO] Compiling 10 source files to
> /home/geronimo/geronimo/2.2/plugins/openejb/geronimo-openejb-clustering-wadi/target/classes
> [INFO]
> ------------------------------------------------------------------------
> [ERROR] BUILD FAILURE
> [INFO]
> ------------------------------------------------------------------------
> [INFO] Compilation failure
>
> /home/geronimo/geronimo/2.2/plugins/openejb/geronimo-openejb-clustering-wadi/src/main/java/org/apache/geronimo/openejb/cluster/container/stateless/ClusteredStatelessContainer.java:[48,7]
> [deprecation]
> invoke(java.lang.Object,java.lang.Class,java.lang.reflect.Method,java.lang.Object[],java.lang.Object)
> in org.apache.openejb.RpcContainer has been deprecated
>
> /home/geronimo/geronimo/2.2/plugins/openejb/geronimo-openejb-clustering-wadi/src/main/java/org/apache/geronimo/openejb/cluster/container/stateless/ClusteredStatelessContainer.java:[48,7]
> [deprecation]
> invoke(java.lang.Object,java.lang.Class,java.lang.reflect.Method,java.lang.Object[],java.lang.Object)
> in org.apache.openejb.RpcContainer has been deprecated
>
> /home/geronimo/geronimo/2.2/plugins/openejb/geronimo-openejb-clustering-wadi/src/main/java/org/apache/geronimo/openejb/cluster/container/stateless/ClusteredStatelessContainer.java:[53,8]
> cannot find symbol
> symbol  : constructor
> StatelessContainer(java.lang.Object,org.apache.openejb.spi.SecurityService,org.apache.openejb.util.Duration,int,int,boolean)
> location: class org.apache.openejb.core.stateless.StatelessContainer
>

[INFO] Building Geronimo Plugins, OpenEJB :: Core
[INFO]    task-segment: [install]
[INFO] ------------------------------------------------------------------------
[INFO] [genesis:validate-configuration {execution: default}]
[INFO] snapshot org.apache.openejb:openejb-core:3.1.3-SNAPSHOT:
checking for updates from codehaus.snapshots
[INFO] snapshot org.apache.openejb:openejb-core:3.1.3-SNAPSHOT:
checking for updates from apache.snapshots
Downloading: http://repository.apache.org/snapshots/org/apache/openejb/openejb-core/3.1.3-SNAPSHOT/openejb-core-3.1.3-*20100131.202752-*12.pom


Seems OpenEJB should deploy the latest 3.1.3 snapshot to the apache
snapshot repo to avoid this failure.






>
> /home/geronimo/geronimo/2.2/plugins/openejb/geronimo-openejb-clustering-wadi/src/main/java/org/apache/geronimo/openejb/cluster/container/stateful/ClusteredStatefulContainer.java:[45,7]
> [deprecation]
> invoke(java.lang.Object,java.lang.Class,java.lang.reflect.Method,java.lang.Object[],java.lang.Object)
> in org.apache.openejb.RpcContainer has been deprecated
>
> /home/geronimo/geronimo/2.2/plugins/openejb/geronimo-openejb-clustering-wadi/src/main/java/org/apache/geronimo/openejb/cluster/container/stateful/ClusteredStatefulContainer.java:[45,7]
> [deprecation]
> invoke(java.lang.Object,java.lang.Class,java.lang.reflect.Method,java.lang.Object[],java.lang.Object)
> in org.apache.openejb.RpcContainer has been deprecated
>
>
> [INFO]
> ------------------------------------------------------------------------
> [INFO] Trace
> org.apache.maven.BuildFailureException: Compilation failure
>        at
> org.apache.maven.lifecycle.DefaultLifecycleExecutor.executeGoals(DefaultLifecycleExecutor.java:580)
>        at
> org.apache.maven.lifecycle.DefaultLifecycleExecutor.executeGoalWithLifecycle(DefaultLifecycleExecutor.java:500)
>        at
> org.apache.maven.lifecycle.DefaultLifecycleExecutor.executeGoal(DefaultLifecycleExecutor.java:479)
>        at
> org.apache.maven.lifecycle.DefaultLifecycleExecutor.executeGoalAndHandleFailures(DefaultLifecycleExecutor.java:331)
>        at
> org.apache.maven.lifecycle.DefaultLifecycleExecutor.executeTaskSegments(DefaultLifecycleExecutor.java:292)
>        at
> org.apache.maven.lifecycle.DefaultLifecycleExecutor.execute(DefaultLifecycleExecutor.java:142)
>        at org.apache.maven.DefaultMaven.doExecute(DefaultMaven.java:336)
>        at org.apache.maven.DefaultMaven.execute(DefaultMaven.java:129)
>        at org.apache.maven.cli.MavenCli.main(MavenCli.java:301)
>        at sun.reflect.NativeMethodAccessorImpl.invoke0(Native Method)
>        at
> sun.reflect.NativeMethodAccessorImpl.invoke(NativeMethodAccessorImpl.java:79)
>        at
> sun.reflect.DelegatingMethodAccessorImpl.invoke(DelegatingMethodAccessorImpl.java:43)
>        at java.lang.reflect.Method.invoke(Method.java:618)
>        at
> org.codehaus.classworlds.Launcher.launchEnhanced(Launcher.java:315)
>        at org.codehaus.classworlds.Launcher.launch(Launcher.java:255)
>        at
> org.codehaus.classworlds.Launcher.mainWithExitCode(Launcher.java:430)
>        at org.codehaus.classworlds.Launcher.main(Launcher.java:375)
> Caused by: org.apache.maven.plugin.CompilationFailureException: Compilation
> failure
>        at
> org.apache.maven.plugin.AbstractCompilerMojo.execute(AbstractCompilerMojo.java:516)
>        at
> org.apache.maven.plugin.CompilerMojo.execute(CompilerMojo.java:114)
>        at
> org.apache.maven.plugin.DefaultPluginManager.executeMojo(DefaultPluginManager.java:453)
>        at
> org.apache.maven.lifecycle.DefaultLifecycleExecutor.executeGoals(DefaultLifecycleExecutor.java:559)
>        ... 16 more
> [INFO]
> ------------------------------------------------------------------------
> [INFO] Total time: 26 minutes 26 seconds
> [INFO] Finished at: Wed Mar 10 20:29:38 EST 2010
> [INFO] Final Memory: 282M/755M
> [INFO]
> ------------------------------------------------------------------------
>



-- 
Shawn

Mime
View raw message