geronimo-dev mailing list archives

Site index · List index
Message view « Date » · « Thread »
Top « Date » · « Thread »
From ga...@apache.org
Subject [BUILD] trunk: Failed for Revision: 927249
Date Thu, 25 Mar 2010 01:36:46 GMT
Geronimo Revision: 927249 built with tests included
 
See the full build-2100.log file at http://people.apache.org/builds/geronimo/server/binaries/trunk/20100324/build-2100.log
 
 
See the unit test reports at http://people.apache.org/builds/geronimo/server/binaries/trunk/20100324/unit-test-reports
 
[INFO] snapshot org.apache.aries.application:org.apache.aries.application.api:0.1-incubating-SNAPSHOT:
checking for updates from jetty.oss.sonatype.org
[INFO] snapshot org.apache.aries.application:org.apache.aries.application.api:0.1-incubating-SNAPSHOT:
checking for updates from openqa-snapshots
[INFO] snapshot org.apache.aries.application:org.apache.aries.application.api:0.1-incubating-SNAPSHOT:
checking for updates from codehaus.snapshots
[INFO] snapshot org.apache.aries.application:org.apache.aries.application.api:0.1-incubating-SNAPSHOT:
checking for updates from apache.snapshots
Downloading: http://repository.apache.org/snapshots/org/apache/aries/application/org.apache.aries.application.api/0.1-incubating-SNAPSHOT/org.apache.aries.application.api-0.1-incubating-20100312.185411-2.pom
2K downloaded  (org.apache.aries.application.api-0.1-incubating-20100312.185411-2.pom)
[INFO] snapshot org.apache.aries.application:application:0.1-incubating-SNAPSHOT: checking
for updates from ops4j.snapshots
[INFO] snapshot org.apache.aries.application:application:0.1-incubating-SNAPSHOT: checking
for updates from jetty.oss.sonatype.org
[INFO] snapshot org.apache.aries.application:application:0.1-incubating-SNAPSHOT: checking
for updates from openqa-snapshots
[INFO] snapshot org.apache.aries.application:application:0.1-incubating-SNAPSHOT: checking
for updates from codehaus.snapshots
[INFO] snapshot org.apache.aries.application:application:0.1-incubating-SNAPSHOT: checking
for updates from apache.snapshots
Downloading: http://repository.apache.org/snapshots/org/apache/aries/application/application/0.1-incubating-SNAPSHOT/application-0.1-incubating-20100312.185411-2.pom
6K downloaded  (application-0.1-incubating-20100312.185411-2.pom)
[INFO] snapshot org.apache.aries.application:org.apache.aries.application.utils:0.1-incubating-SNAPSHOT:
checking for updates from ops4j.snapshots
[INFO] snapshot org.apache.aries.application:org.apache.aries.application.utils:0.1-incubating-SNAPSHOT:
checking for updates from jetty.oss.sonatype.org
[INFO] snapshot org.apache.aries.application:org.apache.aries.application.utils:0.1-incubating-SNAPSHOT:
checking for updates from openqa-snapshots
[INFO] snapshot org.apache.aries.application:org.apache.aries.application.utils:0.1-incubating-SNAPSHOT:
checking for updates from codehaus.snapshots
[INFO] snapshot org.apache.aries.application:org.apache.aries.application.utils:0.1-incubating-SNAPSHOT:
checking for updates from apache.snapshots
Downloading: http://repository.apache.org/snapshots/org/apache/aries/application/org.apache.aries.application.utils/0.1-incubating-SNAPSHOT/org.apache.aries.application.utils-0.1-incubating-20100312.185411-2.pom
4K downloaded  (org.apache.aries.application.utils-0.1-incubating-20100312.185411-2.pom)
[INFO] snapshot org.apache.aries.jpa:org.apache.aries.jpa.container.context:0.1-incubating-SNAPSHOT:
checking for updates from ops4j.snapshots
[INFO] snapshot org.apache.aries.jpa:org.apache.aries.jpa.container.context:0.1-incubating-SNAPSHOT:
checking for updates from jetty.oss.sonatype.org
[INFO] snapshot org.apache.aries.jpa:org.apache.aries.jpa.container.context:0.1-incubating-SNAPSHOT:
checking for updates from openqa-snapshots
[INFO] snapshot org.apache.aries.jpa:org.apache.aries.jpa.container.context:0.1-incubating-SNAPSHOT:
checking for updates from codehaus.snapshots
[INFO] snapshot org.apache.aries.jpa:org.apache.aries.jpa.container.context:0.1-incubating-SNAPSHOT:
checking for updates from apache.snapshots
Downloading: http://repository.apache.org/snapshots/org/apache/aries/jpa/org.apache.aries.jpa.container.context/0.1-incubating-SNAPSHOT/org.apache.aries.jpa.container.context-0.1-incubating-20100312.185411-3.pom
4K downloaded  (org.apache.aries.jpa.container.context-0.1-incubating-20100312.185411-3.pom)
[INFO] snapshot org.apache.geronimo.modules:geronimo-openjpa2:3.0-SNAPSHOT: checking for updates
from ops4j.snapshots
Downloading: http://repository.apache.org/snapshots/org/apache/aries/jpa/org.apache.aries.jpa.api/0.1-incubating-SNAPSHOT/org.apache.aries.jpa.api-0.1-incubating-20100312.185411-3.jar
Downloading: http://repository.apache.org/snapshots/org/apache/aries/application/org.apache.aries.application.api/0.1-incubating-SNAPSHOT/org.apache.aries.application.api-0.1-incubating-20100312.185411-2.jar
13K downloaded  (org.apache.aries.jpa.api-0.1-incubating-20100312.185411-3.jar)
[INFO] snapshot org.apache.geronimo.modules:geronimo-openjpa2:3.0-SNAPSHOT: checking for updates
from jetty.oss.sonatype.org
Downloading: http://repository.apache.org/snapshots/org/apache/aries/jpa/org.apache.aries.jpa.blueprint.aries/0.1-incubating-SNAPSHOT/org.apache.aries.jpa.blueprint.aries-0.1-incubating-20100312.185411-3.jar
[INFO] snapshot org.apache.geronimo.modules:geronimo-openjpa2:3.0-SNAPSHOT: checking for updates
from openqa-snapshots
[INFO] snapshot org.apache.geronimo.modules:geronimo-openjpa2:3.0-SNAPSHOT: checking for updates
from codehaus.snapshots
21K downloaded  (org.apache.aries.application.api-0.1-incubating-20100312.185411-2.jar)
17K downloaded  (org.apache.aries.jpa.blueprint.aries-0.1-incubating-20100312.185411-3.jar)
[INFO] snapshot org.apache.geronimo.modules:geronimo-openjpa2:3.0-SNAPSHOT: checking for updates
from apache.snapshots
Downloading: http://repository.apache.org/snapshots/org/apache/aries/jpa/org.apache.aries.jpa.container/0.1-incubating-SNAPSHOT/org.apache.aries.jpa.container-0.1-incubating-20100312.185411-3.jar
Downloading: http://repository.apache.org/snapshots/org/apache/aries/application/org.apache.aries.application.utils/0.1-incubating-SNAPSHOT/org.apache.aries.application.utils-0.1-incubating-20100312.185411-2.jar
55K downloaded  (org.apache.aries.jpa.container-0.1-incubating-20100312.185411-3.jar)
63K downloaded  (org.apache.aries.application.utils-0.1-incubating-20100312.185411-2.jar)
Downloading: http://repository.apache.org/snapshots/org/apache/aries/jpa/org.apache.aries.jpa.container.context/0.1-incubating-SNAPSHOT/org.apache.aries.jpa.container.context-0.1-incubating-20100312.185411-3.jar
27K downloaded  (org.apache.aries.jpa.container.context-0.1-incubating-20100312.185411-3.jar)
[INFO] [enforcer:enforce {execution: default}]
[INFO] [remote-resources:process {execution: default}]
[INFO] [resources:resources {execution: default-resources}]
[INFO] Using 'UTF-8' encoding to copy filtered resources.
[INFO] skip non existing resourceDirectory /home/geronimo/geronimo/trunk/plugins/openjpa2/openjpa2/src/main/resources
[INFO] skip non existing resourceDirectory /home/geronimo/geronimo/trunk/plugins/openjpa2/openjpa2/src/main/filtered-resources
[INFO] Copying 3 resources
[INFO] [car:validate-configuration {execution: default-validate-configuration}]
[INFO] [car:prepare-plan {execution: default-prepare-plan}]
[INFO] Generated: /home/geronimo/geronimo/trunk/plugins/openjpa2/openjpa2/target/work/plan.xml
[INFO] [car:verify-no-dependency-change {execution: default-verify-no-dependency-change}]
[INFO] ------------------------------------------------------------------------
[ERROR] BUILD FAILURE
[INFO] ------------------------------------------------------------------------
[INFO] Dependencies have changed:
	Added dependencies are saved here: /home/geronimo/geronimo/trunk/plugins/openjpa2/openjpa2/target/history/dependencies.added.xml
	Tree listing is saved here: /home/geronimo/geronimo/trunk/plugins/openjpa2/openjpa2/target/history/treeListing.txt
Delete /home/geronimo/geronimo/trunk/plugins/openjpa2/openjpa2/src/main/history/dependencies.xml
if you are happy with the dependency changes.
[INFO] ------------------------------------------------------------------------
[INFO] Trace
org.apache.maven.BuildFailureException: Dependencies have changed:
	Added dependencies are saved here: /home/geronimo/geronimo/trunk/plugins/openjpa2/openjpa2/target/history/dependencies.added.xml
	Tree listing is saved here: /home/geronimo/geronimo/trunk/plugins/openjpa2/openjpa2/target/history/treeListing.txt
Delete /home/geronimo/geronimo/trunk/plugins/openjpa2/openjpa2/src/main/history/dependencies.xml
if you are happy with the dependency changes.
	at org.apache.maven.lifecycle.DefaultLifecycleExecutor.executeGoals(DefaultLifecycleExecutor.java:715)
	at org.apache.maven.lifecycle.DefaultLifecycleExecutor.executeGoalWithLifecycle(DefaultLifecycleExecutor.java:556)
	at org.apache.maven.lifecycle.DefaultLifecycleExecutor.executeGoal(DefaultLifecycleExecutor.java:535)
	at org.apache.maven.lifecycle.DefaultLifecycleExecutor.executeGoalAndHandleFailures(DefaultLifecycleExecutor.java:387)
	at org.apache.maven.lifecycle.DefaultLifecycleExecutor.executeTaskSegments(DefaultLifecycleExecutor.java:348)
	at org.apache.maven.lifecycle.DefaultLifecycleExecutor.execute(DefaultLifecycleExecutor.java:180)
	at org.apache.maven.DefaultMaven.doExecute(DefaultMaven.java:328)
	at org.apache.maven.DefaultMaven.execute(DefaultMaven.java:138)
	at org.apache.maven.cli.MavenCli.main(MavenCli.java:362)
	at org.apache.maven.cli.compat.CompatibleMain.main(CompatibleMain.java:60)
	at sun.reflect.NativeMethodAccessorImpl.invoke0(Native Method)
	at sun.reflect.NativeMethodAccessorImpl.invoke(NativeMethodAccessorImpl.java:39)
	at sun.reflect.DelegatingMethodAccessorImpl.invoke(DelegatingMethodAccessorImpl.java:25)
	at java.lang.reflect.Method.invoke(Method.java:597)
	at org.codehaus.classworlds.Launcher.launchEnhanced(Launcher.java:315)
	at org.codehaus.classworlds.Launcher.launch(Launcher.java:255)
	at org.codehaus.classworlds.Launcher.mainWithExitCode(Launcher.java:430)
	at org.codehaus.classworlds.Launcher.main(Launcher.java:375)
Caused by: org.apache.maven.plugin.MojoFailureException: Dependencies have changed:
	Added dependencies are saved here: /home/geronimo/geronimo/trunk/plugins/openjpa2/openjpa2/target/history/dependencies.added.xml
	Tree listing is saved here: /home/geronimo/geronimo/trunk/plugins/openjpa2/openjpa2/target/history/treeListing.txt
Delete /home/geronimo/geronimo/trunk/plugins/openjpa2/openjpa2/src/main/history/dependencies.xml
if you are happy with the dependency changes.
	at org.apache.geronimo.mavenplugins.car.DependencyChangeMojo.saveDependencyChanges(DependencyChangeMojo.java:191)
	at org.apache.geronimo.mavenplugins.car.DependencyChangeMojo.execute(DependencyChangeMojo.java:141)
	at org.apache.maven.plugin.DefaultPluginManager.executeMojo(DefaultPluginManager.java:490)
	at org.apache.maven.lifecycle.DefaultLifecycleExecutor.executeGoals(DefaultLifecycleExecutor.java:694)
	... 17 more
[INFO] ------------------------------------------------------------------------
[INFO] Total time: 24 minutes 53 seconds
[INFO] Finished at: Wed Mar 24 21:27:32 EDT 2010
[INFO] Final Memory: 321M/650M
[INFO] ------------------------------------------------------------------------

Mime
View raw message