geronimo-dev mailing list archives

Site index · List index
Message view « Date » · « Thread »
Top « Date » · « Thread »
From ga...@apache.org
Subject [BUILD] trunk: Failed for Revision: 926735
Date Tue, 23 Mar 2010 19:26:29 GMT
Geronimo Revision: 926735 built with tests included
 
See the full build-1500.log file at http://people.apache.org/builds/geronimo/server/binaries/trunk/20100323/build-1500.log
 
 
See the unit test reports at http://people.apache.org/builds/geronimo/server/binaries/trunk/20100323/unit-test-reports
 
[ERROR] --> [org.apache.geronimo.modules.geronimo-transaction-1_6] Missing Constraint:
Import-Package: org.apache.geronimo.management; version="0.0.0"
[ERROR] --> [org.apache.geronimo.framework.geronimo-management] Bundle unresolved: Export-Package:
org.apache.geronimo.management; version="0.0.0"
[ERROR] ----> [org.apache.geronimo.framework.geronimo-management] Missing Constraint: Import-Package:
org.apache.geronimo.system.serverinfo; version="0.0.0"
[ERROR] ----> [org.apache.geronimo.framework.geronimo-system] Bundle unresolved: Export-Package:
org.apache.geronimo.system.serverinfo; version="0.0.0"
[ERROR] ------> [org.apache.geronimo.framework.geronimo-system] Missing Constraint: Import-Package:
javax.xml.namespace; version="1.0.0"
[ERROR] ------> [org.eclipse.osgi] Version mismatch: Import-Package: javax.xml.namespace;
version="1.0.0" Export-Package: javax.xml.namespace; version="0.0.0"
[INFO] [ianal:verify-legal-files {execution: default}]
[INFO] Checking legal files in: geronimo-transaction-1_6-3.0-SNAPSHOT.jar
[INFO] [install:install {execution: default-install}]
[INFO] Installing /home/geronimo/geronimo/trunk/plugins/connector-1_6/geronimo-transaction-1_6/target/geronimo-transaction-1_6-3.0-SNAPSHOT.jar
to /home/geronimo/.m2/repository/org/apache/geronimo/modules/geronimo-transaction-1_6/3.0-SNAPSHOT/geronimo-transaction-1_6-3.0-SNAPSHOT.jar
[INFO] [bundle:install {execution: default-install}]
[INFO] Parsing file:/home/geronimo/.m2/repository/repository.xml
[INFO] Installing org/apache/geronimo/modules/geronimo-transaction-1_6/3.0-SNAPSHOT/geronimo-transaction-1_6-3.0-SNAPSHOT.jar
[INFO] Writing OBR metadata
[INFO] ------------------------------------------------------------------------
[INFO] Building Geronimo Plugins, Connector 1.6 :: Connector wrappers
[INFO]    task-segment: [install]
[INFO] ------------------------------------------------------------------------
[INFO] [genesis:validate-configuration {execution: default}]
[INFO] snapshot org.apache.geronimo.components:geronimo-connector:3.0-SNAPSHOT: checking for
updates from ops4j.snapshots
[INFO] snapshot org.apache.geronimo.components:geronimo-connector:3.0-SNAPSHOT: checking for
updates from jetty.oss.sonatype.org
[INFO] snapshot org.apache.geronimo.components:geronimo-connector:3.0-SNAPSHOT: checking for
updates from codehaus.snapshots
[INFO] snapshot org.apache.geronimo.components:geronimo-connector:3.0-SNAPSHOT: checking for
updates from apache.snapshots
Downloading: http://repository.apache.org/snapshots/org/apache/geronimo/components/geronimo-connector/3.0-SNAPSHOT/geronimo-connector-3.0-20100321.220751-1.pom
3K downloaded  (geronimo-connector-3.0-20100321.220751-1.pom)
[INFO] snapshot org.apache.geronimo.modules:geronimo-transaction-1_6:3.0-SNAPSHOT: checking
for updates from ops4j.snapshots
Downloading: http://repository.apache.org/snapshots/org/apache/geronimo/components/geronimo-connector/3.0-SNAPSHOT/geronimo-connector-3.0-20100321.220751-1.jar
[INFO] snapshot org.apache.geronimo.modules:geronimo-transaction-1_6:3.0-SNAPSHOT: checking
for updates from jetty.oss.sonatype.org
[INFO] snapshot org.apache.geronimo.modules:geronimo-transaction-1_6:3.0-SNAPSHOT: checking
for updates from codehaus.snapshots
[INFO] snapshot org.apache.geronimo.modules:geronimo-transaction-1_6:3.0-SNAPSHOT: checking
for updates from apache.snapshots
110K downloaded  (geronimo-connector-3.0-20100321.220751-1.jar)
Downloading: http://repository.apache.org/snapshots/org/apache/geronimo/components/geronimo-connector/3.0-SNAPSHOT/geronimo-connector-3.0-20100321.220751-1-tests.jar
90K downloaded  (geronimo-connector-3.0-20100321.220751-1-tests.jar)
[INFO] [enforcer:enforce {execution: default}]
[INFO] [remote-resources:process {execution: default}]
[INFO] [resources:resources {execution: default-resources}]
[INFO] Using 'UTF-8' encoding to copy filtered resources.
[INFO] skip non existing resourceDirectory /home/geronimo/geronimo/trunk/plugins/connector-1_6/geronimo-connector-1_6/src/main/resources
[INFO] skip non existing resourceDirectory /home/geronimo/geronimo/trunk/plugins/connector-1_6/geronimo-connector-1_6/src/main/filtered-resources
[INFO] Copying 3 resources
[INFO] [compiler:compile {execution: default-compile}]
[INFO] Compiling 26 source files to /home/geronimo/geronimo/trunk/plugins/connector-1_6/geronimo-connector-1_6/target/classes
[INFO] ------------------------------------------------------------------------
[ERROR] BUILD FAILURE
[INFO] ------------------------------------------------------------------------
[INFO] Compilation failure

/home/geronimo/geronimo/trunk/plugins/connector-1_6/geronimo-connector-1_6/src/main/java/org/apache/geronimo/connector/wrapper/outbound/GenericConnectionManagerGBean.java:[74,8]
cannot find symbol
symbol  : constructor GenericConnectionManager(org.apache.geronimo.connector.outbound.connectionmanagerconfig.TransactionSupport,org.apache.geronimo.connector.outbound.connectionmanagerconfig.PoolingSupport,org.apache.geronimo.connector.outbound.SubjectSource,org.apache.geronimo.connector.outbound.connectiontracking.ConnectionTracker,org.apache.geronimo.transaction.manager.RecoverableTransactionManager,javax.resource.spi.ManagedConnectionFactory,java.lang.String,java.lang.ClassLoader)
location: class org.apache.geronimo.connector.outbound.GenericConnectionManager

/home/geronimo/geronimo/trunk/plugins/connector-1_6/geronimo-connector-1_6/src/main/java/org/apache/geronimo/connector/wrapper/outbound/GenericConnectionManagerGBean.java:[77,8]
doRecovery(javax.resource.spi.ManagedConnectionFactory) in org.apache.geronimo.connector.outbound.AbstractConnectionManager
cannot be applied to ()

/home/geronimo/geronimo/trunk/plugins/connector-1_6/geronimo-connector-1_6/src/main/java/org/apache/geronimo/connector/wrapper/work/ConnectorCallbackHandler.java:[84,62]
[deprecation] login(javax.security.auth.Subject,java.lang.String,javax.security.auth.callback.CallbackHandler)
in org.apache.geronimo.security.ContextManager has been deprecated

/home/geronimo/geronimo/trunk/plugins/connector-1_6/geronimo-connector-1_6/src/main/java/org/apache/geronimo/connector/wrapper/outbound/JCAConnectionFactoryImpl.java:[53,62]
cannot find symbol
symbol  : method getManagedConnectionFactory()
location: class org.apache.geronimo.connector.wrapper.outbound.GenericConnectionManagerGBean

/home/geronimo/geronimo/trunk/plugins/connector-1_6/geronimo-connector-1_6/src/main/java/org/apache/geronimo/connector/wrapper/outbound/JCAConnectionFactoryImpl.java:[58,62]
cannot find symbol
symbol  : method getManagedConnectionFactory()
location: class org.apache.geronimo.connector.wrapper.outbound.GenericConnectionManagerGBean

/home/geronimo/geronimo/trunk/plugins/connector-1_6/geronimo-connector-1_6/src/main/java/org/apache/geronimo/connector/wrapper/outbound/JCAConnectionFactoryImpl.java:[88,32]
createConnectionFactory(javax.resource.spi.ManagedConnectionFactory) in org.apache.geronimo.connector.outbound.AbstractConnectionManager
cannot be applied to ()

/home/geronimo/geronimo/trunk/plugins/connector-1_6/geronimo-connector-1_6/src/main/java/org/apache/geronimo/connector/wrapper/AdminObjectWrapperGBean.java:[45,19]
[deprecation] addOperation(java.lang.String) in org.apache.geronimo.gbean.GBeanInfoBuilder
has been deprecated


[INFO] ------------------------------------------------------------------------
[INFO] Trace
org.apache.maven.BuildFailureException: Compilation failure
	at org.apache.maven.lifecycle.DefaultLifecycleExecutor.executeGoals(DefaultLifecycleExecutor.java:715)
	at org.apache.maven.lifecycle.DefaultLifecycleExecutor.executeGoalWithLifecycle(DefaultLifecycleExecutor.java:556)
	at org.apache.maven.lifecycle.DefaultLifecycleExecutor.executeGoal(DefaultLifecycleExecutor.java:535)
	at org.apache.maven.lifecycle.DefaultLifecycleExecutor.executeGoalAndHandleFailures(DefaultLifecycleExecutor.java:387)
	at org.apache.maven.lifecycle.DefaultLifecycleExecutor.executeTaskSegments(DefaultLifecycleExecutor.java:348)
	at org.apache.maven.lifecycle.DefaultLifecycleExecutor.execute(DefaultLifecycleExecutor.java:180)
	at org.apache.maven.DefaultMaven.doExecute(DefaultMaven.java:328)
	at org.apache.maven.DefaultMaven.execute(DefaultMaven.java:138)
	at org.apache.maven.cli.MavenCli.main(MavenCli.java:362)
	at org.apache.maven.cli.compat.CompatibleMain.main(CompatibleMain.java:60)
	at sun.reflect.NativeMethodAccessorImpl.invoke0(Native Method)
	at sun.reflect.NativeMethodAccessorImpl.invoke(NativeMethodAccessorImpl.java:39)
	at sun.reflect.DelegatingMethodAccessorImpl.invoke(DelegatingMethodAccessorImpl.java:25)
	at java.lang.reflect.Method.invoke(Method.java:597)
	at org.codehaus.classworlds.Launcher.launchEnhanced(Launcher.java:315)
	at org.codehaus.classworlds.Launcher.launch(Launcher.java:255)
	at org.codehaus.classworlds.Launcher.mainWithExitCode(Launcher.java:430)
	at org.codehaus.classworlds.Launcher.main(Launcher.java:375)
Caused by: org.apache.maven.plugin.CompilationFailureException: Compilation failure
	at org.apache.maven.plugin.AbstractCompilerMojo.execute(AbstractCompilerMojo.java:516)
	at org.apache.maven.plugin.CompilerMojo.execute(CompilerMojo.java:114)
	at org.apache.maven.plugin.DefaultPluginManager.executeMojo(DefaultPluginManager.java:490)
	at org.apache.maven.lifecycle.DefaultLifecycleExecutor.executeGoals(DefaultLifecycleExecutor.java:694)
	... 17 more
[INFO] ------------------------------------------------------------------------
[INFO] Total time: 16 minutes 38 seconds
[INFO] Finished at: Tue Mar 23 15:17:48 EDT 2010
[INFO] Final Memory: 453M/701M
[INFO] ------------------------------------------------------------------------

Mime
View raw message