geronimo-dev mailing list archives

Site index · List index
Message view « Date » · « Thread »
Top « Date » · « Thread »
From ga...@apache.org
Subject [BUILD] trunk: Failed for Revision: 926255
Date Mon, 22 Mar 2010 19:29:53 GMT
Geronimo Revision: 926255 built with tests included
 
See the full build-1500.log file at http://people.apache.org/builds/geronimo/server/binaries/trunk/20100322/build-1500.log
 
 
See the unit test reports at http://people.apache.org/builds/geronimo/server/binaries/trunk/20100322/unit-test-reports
 
    [mkdir] Created dir: /home/geronimo/geronimo/trunk/plugins/connector-1_6/geronimo-connector-builder-1_6/target/test-rar-15/META-INF
     [copy] Copying 2 files to /home/geronimo/geronimo/trunk/plugins/connector-1_6/geronimo-connector-builder-1_6/target/test-rar-15/META-INF
      [jar] Building jar: /home/geronimo/geronimo/trunk/plugins/connector-1_6/geronimo-connector-builder-1_6/target/test-rar-15.rar
    [mkdir] Created dir: /home/geronimo/geronimo/trunk/plugins/connector-1_6/geronimo-connector-builder-1_6/target/test-rar-15-notx/META-INF
     [copy] Copying 2 files to /home/geronimo/geronimo/trunk/plugins/connector-1_6/geronimo-connector-builder-1_6/target/test-rar-15-notx/META-INF
      [jar] Building jar: /home/geronimo/geronimo/trunk/plugins/connector-1_6/geronimo-connector-builder-1_6/target/test-rar-15-notx.rar
    [mkdir] Created dir: /home/geronimo/geronimo/trunk/plugins/connector-1_6/geronimo-connector-builder-1_6/target/test-rar-15-localtx/META-INF
     [copy] Copying 2 files to /home/geronimo/geronimo/trunk/plugins/connector-1_6/geronimo-connector-builder-1_6/target/test-rar-15-localtx/META-INF
      [jar] Building jar: /home/geronimo/geronimo/trunk/plugins/connector-1_6/geronimo-connector-builder-1_6/target/test-rar-15-localtx.rar
      [jar] Building jar: /home/geronimo/geronimo/trunk/plugins/connector-1_6/geronimo-connector-builder-1_6/target/test-ear.ear
    [mkdir] Created dir: /home/geronimo/geronimo/trunk/plugins/connector-1_6/geronimo-connector-builder-1_6/target/test-rar-10-noger/META-INF
     [copy] Copying 1 file to /home/geronimo/geronimo/trunk/plugins/connector-1_6/geronimo-connector-builder-1_6/target/test-rar-10-noger/META-INF
      [jar] Building jar: /home/geronimo/geronimo/trunk/plugins/connector-1_6/geronimo-connector-builder-1_6/target/test-rar-10-noger.rar
    [mkdir] Created dir: /home/geronimo/geronimo/trunk/plugins/connector-1_6/geronimo-connector-builder-1_6/target/test-rar-15-noger/META-INF
     [copy] Copying 1 file to /home/geronimo/geronimo/trunk/plugins/connector-1_6/geronimo-connector-builder-1_6/target/test-rar-15-noger/META-INF
      [jar] Building jar: /home/geronimo/geronimo/trunk/plugins/connector-1_6/geronimo-connector-builder-1_6/target/test-rar-15-noger.rar
      [jar] Building jar: /home/geronimo/geronimo/trunk/plugins/connector-1_6/geronimo-connector-builder-1_6/target/test-ear-noger.ear
[INFO] Executed tasks
[INFO] [compiler:testCompile {execution: default-testCompile}]
[INFO] Compiling 23 source files to /home/geronimo/geronimo/trunk/plugins/connector-1_6/geronimo-connector-builder-1_6/target/test-classes
[WARNING] /home/geronimo/geronimo/trunk/plugins/connector-1_6/geronimo-connector-builder-1_6/src/test/java/org/apache/geronimo/connector/deployment/MockRARDeployable.java:[67,22]
[deprecation] getModuleDTDVersion() in javax.enterprise.deploy.model.DeployableObject has
been deprecated

[WARNING] /home/geronimo/geronimo/trunk/plugins/connector-1_6/geronimo-connector-builder-1_6/src/test/java/org/apache/geronimo/connector/deployment/RAR_1_0DConfigBeanTest.java:[113,43]
[deprecation] toURL() in java.io.File has been deprecated

[INFO] [surefire:test {execution: default-test}]
[INFO] Surefire report directory: /home/geronimo/geronimo/trunk/plugins/connector-1_6/geronimo-connector-builder-1_6/target/surefire-reports

-------------------------------------------------------
 T E S T S
-------------------------------------------------------
Running org.apache.geronimo.connector.deployment.RAR_1_5DConfigBeanTest
Tests run: 1, Failures: 0, Errors: 0, Skipped: 0, Time elapsed: 0.046 sec
Running org.apache.geronimo.connector.deployment.ConnectorModuleBuilderTest
Tests run: 12, Failures: 0, Errors: 8, Skipped: 0, Time elapsed: 4.218 sec <<< FAILURE!
Running org.apache.geronimo.connector.deployment.RAR_1_0DConfigBeanTest
Tests run: 1, Failures: 0, Errors: 0, Skipped: 0, Time elapsed: 0.005 sec
Running org.apache.geronimo.connector.deployment.MessageDestinationTest
Tests run: 3, Failures: 0, Errors: 0, Skipped: 0, Time elapsed: 0.096 sec
Running org.apache.geronimo.connector.deployment.PlanParsingTest
Tests run: 7, Failures: 0, Errors: 0, Skipped: 0, Time elapsed: 0.164 sec
Running org.apache.geronimo.connector.deployment.annotation.AnnotationHelperTest
Tests run: 1, Failures: 0, Errors: 0, Skipped: 0, Time elapsed: 0.185 sec
Running org.apache.geronimo.connector.deployment.SchemaConversionTest
Tests run: 1, Failures: 0, Errors: 0, Skipped: 0, Time elapsed: 0.003 sec

Results :

Tests in error: 
  testBuildEar(org.apache.geronimo.connector.deployment.ConnectorModuleBuilderTest)
  testBuildUnpackedModule(org.apache.geronimo.connector.deployment.ConnectorModuleBuilderTest)
  testBuildUnpackedAltSpecVendorDDModule(org.apache.geronimo.connector.deployment.ConnectorModuleBuilderTest)
  testBuildPackedModule(org.apache.geronimo.connector.deployment.ConnectorModuleBuilderTest)
  testBuildUnpackedModule15(org.apache.geronimo.connector.deployment.ConnectorModuleBuilderTest)
  testBuildPackedModule15(org.apache.geronimo.connector.deployment.ConnectorModuleBuilderTest)
  testBuildUnpackedModule16(org.apache.geronimo.connector.deployment.ConnectorModuleBuilderTest)
  testBuildPackedModule16(org.apache.geronimo.connector.deployment.ConnectorModuleBuilderTest)

Tests run: 26, Failures: 0, Errors: 8, Skipped: 0

[INFO] ------------------------------------------------------------------------
[ERROR] BUILD FAILURE
[INFO] ------------------------------------------------------------------------
[INFO] There are test failures.

Please refer to /home/geronimo/geronimo/trunk/plugins/connector-1_6/geronimo-connector-builder-1_6/target/surefire-reports
for the individual test results.
[INFO] ------------------------------------------------------------------------
[INFO] Trace
org.apache.maven.BuildFailureException: There are test failures.

Please refer to /home/geronimo/geronimo/trunk/plugins/connector-1_6/geronimo-connector-builder-1_6/target/surefire-reports
for the individual test results.
	at org.apache.maven.lifecycle.DefaultLifecycleExecutor.executeGoals(DefaultLifecycleExecutor.java:715)
	at org.apache.maven.lifecycle.DefaultLifecycleExecutor.executeGoalWithLifecycle(DefaultLifecycleExecutor.java:556)
	at org.apache.maven.lifecycle.DefaultLifecycleExecutor.executeGoal(DefaultLifecycleExecutor.java:535)
	at org.apache.maven.lifecycle.DefaultLifecycleExecutor.executeGoalAndHandleFailures(DefaultLifecycleExecutor.java:387)
	at org.apache.maven.lifecycle.DefaultLifecycleExecutor.executeTaskSegments(DefaultLifecycleExecutor.java:348)
	at org.apache.maven.lifecycle.DefaultLifecycleExecutor.execute(DefaultLifecycleExecutor.java:180)
	at org.apache.maven.DefaultMaven.doExecute(DefaultMaven.java:328)
	at org.apache.maven.DefaultMaven.execute(DefaultMaven.java:138)
	at org.apache.maven.cli.MavenCli.main(MavenCli.java:362)
	at org.apache.maven.cli.compat.CompatibleMain.main(CompatibleMain.java:60)
	at sun.reflect.NativeMethodAccessorImpl.invoke0(Native Method)
	at sun.reflect.NativeMethodAccessorImpl.invoke(NativeMethodAccessorImpl.java:39)
	at sun.reflect.DelegatingMethodAccessorImpl.invoke(DelegatingMethodAccessorImpl.java:25)
	at java.lang.reflect.Method.invoke(Method.java:597)
	at org.codehaus.classworlds.Launcher.launchEnhanced(Launcher.java:315)
	at org.codehaus.classworlds.Launcher.launch(Launcher.java:255)
	at org.codehaus.classworlds.Launcher.mainWithExitCode(Launcher.java:430)
	at org.codehaus.classworlds.Launcher.main(Launcher.java:375)
Caused by: org.apache.maven.plugin.MojoFailureException: There are test failures.

Please refer to /home/geronimo/geronimo/trunk/plugins/connector-1_6/geronimo-connector-builder-1_6/target/surefire-reports
for the individual test results.
	at org.apache.maven.plugin.surefire.SurefirePlugin.execute(SurefirePlugin.java:575)
	at org.apache.maven.plugin.DefaultPluginManager.executeMojo(DefaultPluginManager.java:490)
	at org.apache.maven.lifecycle.DefaultLifecycleExecutor.executeGoals(DefaultLifecycleExecutor.java:694)
	... 17 more
[INFO] ------------------------------------------------------------------------
[INFO] Total time: 19 minutes 50 seconds
[INFO] Finished at: Mon Mar 22 15:20:55 EDT 2010
[INFO] Final Memory: 465M/656M
[INFO] ------------------------------------------------------------------------

Mime
View raw message