geronimo-dev mailing list archives

Site index · List index
Message view « Date » · « Thread »
Top « Date » · « Thread »
From ga...@apache.org
Subject [BUILD] trunk: Failed for Revision: 925510
Date Sat, 20 Mar 2010 01:26:42 GMT
Geronimo Revision: 925510 built with tests included
 
See the full build-2100.log file at http://people.apache.org/builds/geronimo/server/binaries/trunk/20100319/build-2100.log
 
 
See the unit test reports at http://people.apache.org/builds/geronimo/server/binaries/trunk/20100319/unit-test-reports
 
Downloading: http://oss.sonatype.org/content/repositories/jetty//org/apache/portals/portlet-api_2.0_spec/1.0/portlet-api_2.0_spec-1.0.jar
[INFO] snapshot org.apache.geronimo.plugins:geronimo-pluto:3.0-SNAPSHOT: checking for updates
from ops4j.snapshots
Downloading: http://oss.sonatype.org/content/repositories/jetty//commons-collections/commons-collections/3.2.1/commons-collections-3.2.1.jar
[INFO] snapshot org.apache.geronimo.bundles:jstl:1.2_1-SNAPSHOT: checking for updates from
ops4j.snapshots
Downloading: http://repository.apache.org/snapshots/org/apache/portals/pluto/pluto-taglib/2.0.1-SNAPSHOT/pluto-taglib-2.0.1-20100212.034500-6.jar
[INFO] Unable to find resource 'org.apache.portals:portlet-api_2.0_spec:jar:1.0' in repository
jetty.oss.sonatype.org (http://oss.sonatype.org/content/repositories/jetty/)
[INFO] Unable to find resource 'commons-collections:commons-collections:jar:3.2.1' in repository
jetty.oss.sonatype.org (http://oss.sonatype.org/content/repositories/jetty/)
Downloading: http://svn.apache.org/repos/asf/servicemix/m2-repo//commons-collections/commons-collections/3.2.1/commons-collections-3.2.1.jar
Downloading: http://svn.apache.org/repos/asf/servicemix/m2-repo//org/apache/portals/portlet-api_2.0_spec/1.0/portlet-api_2.0_spec-1.0.jar
[INFO] snapshot org.apache.geronimo.plugins:geronimo-pluto:3.0-SNAPSHOT: checking for updates
from jetty.oss.sonatype.org
[INFO] snapshot org.apache.geronimo.bundles:jstl:1.2_1-SNAPSHOT: checking for updates from
jetty.oss.sonatype.org
[INFO] snapshot org.apache.geronimo.plugins:geronimo-pluto:3.0-SNAPSHOT: checking for updates
from codehaus.snapshots
[INFO] Unable to find resource 'commons-collections:commons-collections:jar:3.2.1' in repository
smx.svn (http://svn.apache.org/repos/asf/servicemix/m2-repo/)
Downloading: http://download.java.net/maven/1//commons-collections/jars/commons-collections-3.2.1.jar
[INFO] Unable to find resource 'org.apache.portals:portlet-api_2.0_spec:jar:1.0' in repository
smx.svn (http://svn.apache.org/repos/asf/servicemix/m2-repo/)
Downloading: http://download.java.net/maven/1//org.apache.portals/jars/portlet-api_2.0_spec-1.0.jar
[INFO] snapshot org.apache.geronimo.bundles:jstl:1.2_1-SNAPSHOT: checking for updates from
codehaus.snapshots
[INFO] snapshot org.apache.geronimo.plugins:geronimo-pluto:3.0-SNAPSHOT: checking for updates
from apache.snapshots
[INFO] snapshot org.apache.geronimo.bundles:jstl:1.2_1-SNAPSHOT: checking for updates from
apache.snapshots
[INFO] Unable to find resource 'commons-collections:commons-collections:jar:3.2.1' in repository
java.net (http://download.java.net/maven/1/)
Downloading: http://nexus.openqa.org/content/repositories/releases/commons-collections/commons-collections/3.2.1/commons-collections-3.2.1.jar
[INFO] Unable to find resource 'org.apache.portals:portlet-api_2.0_spec:jar:1.0' in repository
java.net (http://download.java.net/maven/1/)
Downloading: http://nexus.openqa.org/content/repositories/releases/org/apache/portals/portlet-api_2.0_spec/1.0/portlet-api_2.0_spec-1.0.jar
[WARNING] Unable to get resource 'commons-collections:commons-collections:jar:3.2.1' from
repository openqa-releases (http://nexus.openqa.org/content/repositories/releases): Error
transferring file: Server returned HTTP response code: 502 for URL: http://nexus.openqa.org/content/repositories/releases/commons-collections/commons-collections/3.2.1/commons-collections-3.2.1.jar
Downloading: http://maven.rtp.raleigh.ibm.com/nexus-proxy//commons-collections/commons-collections/3.2.1/commons-collections-3.2.1.jar
[WARNING] Unable to get resource 'org.apache.portals:portlet-api_2.0_spec:jar:1.0' from repository
openqa-releases (http://nexus.openqa.org/content/repositories/releases): Error transferring
file: Server returned HTTP response code: 502 for URL: http://nexus.openqa.org/content/repositories/releases/org/apache/portals/portlet-api_2.0_spec/1.0/portlet-api_2.0_spec-1.0.jar
Downloading: http://maven.rtp.raleigh.ibm.com/nexus-proxy//org/apache/portals/portlet-api_2.0_spec/1.0/portlet-api_2.0_spec-1.0.jar
52K downloaded  (portlet-api_2.0_spec-1.0.jar)
Downloading: http://repository.apache.org/snapshots/org/apache/geronimo/specs/geronimo-el_2.2_spec/1.0-SNAPSHOT/geronimo-el_2.2_spec-1.0-20100219.190512-8.jar
561K downloaded  (commons-collections-3.2.1.jar)
41K downloaded  (pluto-taglib-2.0.1-20100212.034500-6.jar)
Downloading: http://oss.sonatype.org/content/repositories/jetty//org/apache/servicemix/bundles/org.apache.servicemix.bundles.commons-io/1.3.2_1/org.apache.servicemix.bundles.commons-io-1.3.2_1.jar
[INFO] Unable to find resource 'org.apache.servicemix.bundles:org.apache.servicemix.bundles.commons-io:jar:1.3.2_1'
in repository jetty.oss.sonatype.org (http://oss.sonatype.org/content/repositories/jetty/)
Downloading: http://svn.apache.org/repos/asf/servicemix/m2-repo//org/apache/servicemix/bundles/org.apache.servicemix.bundles.commons-io/1.3.2_1/org.apache.servicemix.bundles.commons-io-1.3.2_1.jar
41K downloaded  (geronimo-el_2.2_spec-1.0-20100219.190512-8.jar)
[INFO] Unable to find resource 'org.apache.servicemix.bundles:org.apache.servicemix.bundles.commons-io:jar:1.3.2_1'
in repository smx.svn (http://svn.apache.org/repos/asf/servicemix/m2-repo/)
Downloading: http://download.java.net/maven/1//org.apache.servicemix.bundles/jars/org.apache.servicemix.bundles.commons-io-1.3.2_1.jar
Downloading: http://repository.apache.org/snapshots/org/apache/geronimo/specs/geronimo-ccpp_1.0_spec/1.0.0-SNAPSHOT/geronimo-ccpp_1.0_spec-1.0.0-20091210.180911-1.jar
[INFO] Unable to find resource 'org.apache.servicemix.bundles:org.apache.servicemix.bundles.commons-io:jar:1.3.2_1'
in repository java.net (http://download.java.net/maven/1/)
Downloading: http://nexus.openqa.org/content/repositories/releases/org/apache/servicemix/bundles/org.apache.servicemix.bundles.commons-io/1.3.2_1/org.apache.servicemix.bundles.commons-io-1.3.2_1.jar
[WARNING] Unable to get resource 'org.apache.servicemix.bundles:org.apache.servicemix.bundles.commons-io:jar:1.3.2_1'
from repository openqa-releases (http://nexus.openqa.org/content/repositories/releases): Error
transferring file: Server returned HTTP response code: 502 for URL: http://nexus.openqa.org/content/repositories/releases/org/apache/servicemix/bundles/org.apache.servicemix.bundles.commons-io/1.3.2_1/org.apache.servicemix.bundles.commons-io-1.3.2_1.jar
Downloading: http://maven.rtp.raleigh.ibm.com/nexus-proxy//org/apache/servicemix/bundles/org.apache.servicemix.bundles.commons-io/1.3.2_1/org.apache.servicemix.bundles.commons-io-1.3.2_1.jar
86K downloaded  (org.apache.servicemix.bundles.commons-io-1.3.2_1.jar)
20K downloaded  (geronimo-ccpp_1.0_spec-1.0.0-20091210.180911-1.jar)
[INFO] [enforcer:enforce {execution: default}]
[INFO] [remote-resources:process {execution: default}]
[INFO] [resources:resources {execution: default-resources}]
[INFO] Using 'UTF-8' encoding to copy filtered resources.
[INFO] skip non existing resourceDirectory /home/geronimo/geronimo/trunk/plugins/pluto/pluto-support/src/main/resources
[INFO] skip non existing resourceDirectory /home/geronimo/geronimo/trunk/plugins/pluto/pluto-support/src/main/filtered-resources
[INFO] Copying 3 resources
[INFO] [car:validate-configuration {execution: default-validate-configuration}]
[INFO] [car:prepare-plan {execution: default-prepare-plan}]
[INFO] Generated: /home/geronimo/geronimo/trunk/plugins/pluto/pluto-support/target/work/plan.xml
[INFO] [car:verify-no-dependency-change {execution: default-verify-no-dependency-change}]
[INFO] ------------------------------------------------------------------------
[ERROR] BUILD FAILURE
[INFO] ------------------------------------------------------------------------
[INFO] Dependencies have changed:
	Added dependencies are saved here: /home/geronimo/geronimo/trunk/plugins/pluto/pluto-support/target/history/dependencies.added.xml
	Tree listing is saved here: /home/geronimo/geronimo/trunk/plugins/pluto/pluto-support/target/history/treeListing.txt
Delete /home/geronimo/geronimo/trunk/plugins/pluto/pluto-support/src/main/history/dependencies.xml
if you are happy with the dependency changes.
[INFO] ------------------------------------------------------------------------
[INFO] Trace
org.apache.maven.BuildFailureException: Dependencies have changed:
	Added dependencies are saved here: /home/geronimo/geronimo/trunk/plugins/pluto/pluto-support/target/history/dependencies.added.xml
	Tree listing is saved here: /home/geronimo/geronimo/trunk/plugins/pluto/pluto-support/target/history/treeListing.txt
Delete /home/geronimo/geronimo/trunk/plugins/pluto/pluto-support/src/main/history/dependencies.xml
if you are happy with the dependency changes.
	at org.apache.maven.lifecycle.DefaultLifecycleExecutor.executeGoals(DefaultLifecycleExecutor.java:715)
	at org.apache.maven.lifecycle.DefaultLifecycleExecutor.executeGoalWithLifecycle(DefaultLifecycleExecutor.java:556)
	at org.apache.maven.lifecycle.DefaultLifecycleExecutor.executeGoal(DefaultLifecycleExecutor.java:535)
	at org.apache.maven.lifecycle.DefaultLifecycleExecutor.executeGoalAndHandleFailures(DefaultLifecycleExecutor.java:387)
	at org.apache.maven.lifecycle.DefaultLifecycleExecutor.executeTaskSegments(DefaultLifecycleExecutor.java:348)
	at org.apache.maven.lifecycle.DefaultLifecycleExecutor.execute(DefaultLifecycleExecutor.java:180)
	at org.apache.maven.DefaultMaven.doExecute(DefaultMaven.java:328)
	at org.apache.maven.DefaultMaven.execute(DefaultMaven.java:138)
	at org.apache.maven.cli.MavenCli.main(MavenCli.java:362)
	at org.apache.maven.cli.compat.CompatibleMain.main(CompatibleMain.java:60)
	at sun.reflect.NativeMethodAccessorImpl.invoke0(Native Method)
	at sun.reflect.NativeMethodAccessorImpl.invoke(NativeMethodAccessorImpl.java:39)
	at sun.reflect.DelegatingMethodAccessorImpl.invoke(DelegatingMethodAccessorImpl.java:25)
	at java.lang.reflect.Method.invoke(Method.java:597)
	at org.codehaus.classworlds.Launcher.launchEnhanced(Launcher.java:315)
	at org.codehaus.classworlds.Launcher.launch(Launcher.java:255)
	at org.codehaus.classworlds.Launcher.mainWithExitCode(Launcher.java:430)
	at org.codehaus.classworlds.Launcher.main(Launcher.java:375)
Caused by: org.apache.maven.plugin.MojoFailureException: Dependencies have changed:
	Added dependencies are saved here: /home/geronimo/geronimo/trunk/plugins/pluto/pluto-support/target/history/dependencies.added.xml
	Tree listing is saved here: /home/geronimo/geronimo/trunk/plugins/pluto/pluto-support/target/history/treeListing.txt
Delete /home/geronimo/geronimo/trunk/plugins/pluto/pluto-support/src/main/history/dependencies.xml
if you are happy with the dependency changes.
	at org.apache.geronimo.mavenplugins.car.DependencyChangeMojo.saveDependencyChanges(DependencyChangeMojo.java:191)
	at org.apache.geronimo.mavenplugins.car.DependencyChangeMojo.execute(DependencyChangeMojo.java:141)
	at org.apache.maven.plugin.DefaultPluginManager.executeMojo(DefaultPluginManager.java:490)
	at org.apache.maven.lifecycle.DefaultLifecycleExecutor.executeGoals(DefaultLifecycleExecutor.java:694)
	... 17 more
[INFO] ------------------------------------------------------------------------
[INFO] Total time: 16 minutes 2 seconds
[INFO] Finished at: Fri Mar 19 21:17:11 EDT 2010
[INFO] Final Memory: 440M/592M
[INFO] ------------------------------------------------------------------------

Mime
View raw message