geronimo-dev mailing list archives

Site index · List index
Message view « Date » · « Thread »
Top « Date » · « Thread »
From ga...@apache.org
Subject [BUILD] trunk: Failed for Revision: 922409
Date Fri, 12 Mar 2010 20:21:57 GMT
Geronimo Revision: 922409 built with tests included
 
See the full build-1500.log file at http://people.apache.org/builds/geronimo/server/binaries/trunk/20100312/build-1500.log
 
 
See the unit test reports at http://people.apache.org/builds/geronimo/server/binaries/trunk/20100312/unit-test-reports
 
[INFO] snapshot org.apache.aries.jndi:org.apache.aries.jndi.core:0.1-incubating-SNAPSHOT:
checking for updates from jetty.oss.sonatype.org
[INFO] snapshot org.apache.aries.jndi:org.apache.aries.jndi.core:0.1-incubating-SNAPSHOT:
checking for updates from openqa-snapshots
[WARNING] repository metadata for: 'snapshot org.apache.aries.jndi:org.apache.aries.jndi.core:0.1-incubating-SNAPSHOT'
could not be retrieved from repository: openqa-snapshots due to an error: Error transferring
file: Server returned HTTP response code: 502 for URL: http://nexus.openqa.org/content/repositories/snapshots/org/apache/aries/jndi/org.apache.aries.jndi.core/0.1-incubating-SNAPSHOT/maven-metadata.xml
[INFO] Repository 'openqa-snapshots' will be blacklisted
[INFO] snapshot org.apache.aries.jndi:org.apache.aries.jndi.core:0.1-incubating-SNAPSHOT:
checking for updates from codehaus.snapshots
[INFO] snapshot org.apache.aries.jndi:org.apache.aries.jndi.core:0.1-incubating-SNAPSHOT:
checking for updates from apache.snapshots
Downloading: http://repository.apache.org/snapshots/org/apache/aries/jndi/org.apache.aries.jndi.core/0.1-incubating-SNAPSHOT/org.apache.aries.jndi.core-0.1-incubating-20100312.185411-2.pom
2K downloaded  (org.apache.aries.jndi.core-0.1-incubating-20100312.185411-2.pom)
[INFO] snapshot org.apache.aries.jndi:jndi:0.1-incubating-SNAPSHOT: checking for updates from
ops4j.snapshots
[INFO] snapshot org.apache.aries.jndi:jndi:0.1-incubating-SNAPSHOT: checking for updates from
jetty.oss.sonatype.org
[INFO] snapshot org.apache.aries.jndi:jndi:0.1-incubating-SNAPSHOT: checking for updates from
codehaus.snapshots
[INFO] snapshot org.apache.aries.jndi:jndi:0.1-incubating-SNAPSHOT: checking for updates from
apache.snapshots
Downloading: http://repository.apache.org/snapshots/org/apache/aries/jndi/jndi/0.1-incubating-SNAPSHOT/jndi-0.1-incubating-20100312.185411-2.pom
3K downloaded  (jndi-0.1-incubating-20100312.185411-2.pom)
[INFO] snapshot org.apache.aries.jndi:org.apache.aries.jndi.url:0.1-incubating-SNAPSHOT: checking
for updates from ops4j.snapshots
[INFO] snapshot org.apache.aries.jndi:org.apache.aries.jndi.url:0.1-incubating-SNAPSHOT: checking
for updates from jetty.oss.sonatype.org
[INFO] snapshot org.apache.aries.jndi:org.apache.aries.jndi.url:0.1-incubating-SNAPSHOT: checking
for updates from codehaus.snapshots
[INFO] snapshot org.apache.aries.jndi:org.apache.aries.jndi.url:0.1-incubating-SNAPSHOT: checking
for updates from apache.snapshots
Downloading: http://repository.apache.org/snapshots/org/apache/aries/jndi/org.apache.aries.jndi.url/0.1-incubating-SNAPSHOT/org.apache.aries.jndi.url-0.1-incubating-20100312.185411-2.pom
3K downloaded  (org.apache.aries.jndi.url-0.1-incubating-20100312.185411-2.pom)
[INFO] snapshot org.apache.aries:org.apache.aries.util:0.1-incubating-SNAPSHOT: checking for
updates from ops4j.snapshots
[INFO] snapshot org.apache.aries:org.apache.aries.util:0.1-incubating-SNAPSHOT: checking for
updates from jetty.oss.sonatype.org
[INFO] snapshot org.apache.aries:org.apache.aries.util:0.1-incubating-SNAPSHOT: checking for
updates from codehaus.snapshots
[INFO] snapshot org.apache.aries:org.apache.aries.util:0.1-incubating-SNAPSHOT: checking for
updates from apache.snapshots
Downloading: http://repository.apache.org/snapshots/org/apache/aries/org.apache.aries.util/0.1-incubating-SNAPSHOT/org.apache.aries.util-0.1-incubating-20100312.185411-2.pom
3K downloaded  (org.apache.aries.util-0.1-incubating-20100312.185411-2.pom)
Downloading: http://repository.apache.org/snapshots/org/apache/aries/jndi/org.apache.aries.jndi.core/0.1-incubating-SNAPSHOT/org.apache.aries.jndi.core-0.1-incubating-20100312.185411-2.jar
Downloading: http://repository.apache.org/snapshots/org/apache/aries/org.apache.aries.util/0.1-incubating-SNAPSHOT/org.apache.aries.util-0.1-incubating-20100312.185411-2.jar
[INFO] snapshot org.apache.geronimo.framework:geronimo-core:3.0-SNAPSHOT: checking for updates
from ops4j.snapshots
19K downloaded  (org.apache.aries.jndi.core-0.1-incubating-20100312.185411-2.jar)
[INFO] snapshot org.apache.geronimo.framework:geronimo-core:3.0-SNAPSHOT: checking for updates
from jetty.oss.sonatype.org
Downloading: http://repository.apache.org/snapshots/org/apache/aries/jndi/org.apache.aries.jndi.url/0.1-incubating-SNAPSHOT/org.apache.aries.jndi.url-0.1-incubating-20100312.185411-2.jar
[INFO] snapshot org.apache.geronimo.framework:geronimo-core:3.0-SNAPSHOT: checking for updates
from codehaus.snapshots
[INFO] snapshot org.apache.geronimo.framework:geronimo-core:3.0-SNAPSHOT: checking for updates
from apache.snapshots
17K downloaded  (org.apache.aries.util-0.1-incubating-20100312.185411-2.jar)
31K downloaded  (org.apache.aries.jndi.url-0.1-incubating-20100312.185411-2.jar)
[INFO] snapshot org.apache.geronimo.framework:geronimo-interceptor:3.0-SNAPSHOT: checking
for updates from ops4j.snapshots
[INFO] snapshot org.apache.geronimo.framework:geronimo-interceptor:3.0-SNAPSHOT: checking
for updates from jetty.oss.sonatype.org
[INFO] snapshot org.apache.geronimo.framework:geronimo-interceptor:3.0-SNAPSHOT: checking
for updates from codehaus.snapshots
[INFO] snapshot org.apache.geronimo.framework:geronimo-interceptor:3.0-SNAPSHOT: checking
for updates from apache.snapshots
[INFO] snapshot org.apache.geronimo.framework:geronimo-naming:3.0-SNAPSHOT: checking for updates
from ops4j.snapshots
[INFO] snapshot org.apache.geronimo.framework:geronimo-naming:3.0-SNAPSHOT: checking for updates
from jetty.oss.sonatype.org
[INFO] snapshot org.apache.geronimo.framework:geronimo-naming:3.0-SNAPSHOT: checking for updates
from codehaus.snapshots
[INFO] snapshot org.apache.geronimo.framework:geronimo-naming:3.0-SNAPSHOT: checking for updates
from apache.snapshots
[INFO] [enforcer:enforce {execution: default}]
[INFO] [remote-resources:process {execution: default}]
[INFO] [resources:resources {execution: default-resources}]
[INFO] Using 'UTF-8' encoding to copy filtered resources.
[INFO] Copying 1 resource
[INFO] skip non existing resourceDirectory /home/geronimo/geronimo/trunk/framework/configs/rmi-naming/src/main/filtered-resources
[INFO] Copying 3 resources
[INFO] [car:validate-configuration {execution: default-validate-configuration}]
[INFO] [car:prepare-plan {execution: default-prepare-plan}]
[INFO] Generated: /home/geronimo/geronimo/trunk/framework/configs/rmi-naming/target/work/plan.xml
[INFO] [car:verify-no-dependency-change {execution: default-verify-no-dependency-change}]
[INFO] ------------------------------------------------------------------------
[ERROR] BUILD FAILURE
[INFO] ------------------------------------------------------------------------
[INFO] Dependencies have changed:
	Added dependencies are saved here: /home/geronimo/geronimo/trunk/framework/configs/rmi-naming/target/history/dependencies.added.xml
	Tree listing is saved here: /home/geronimo/geronimo/trunk/framework/configs/rmi-naming/target/history/treeListing.txt
Delete /home/geronimo/geronimo/trunk/framework/configs/rmi-naming/src/main/history/dependencies.xml
if you are happy with the dependency changes.
[INFO] ------------------------------------------------------------------------
[INFO] Trace
org.apache.maven.BuildFailureException: Dependencies have changed:
	Added dependencies are saved here: /home/geronimo/geronimo/trunk/framework/configs/rmi-naming/target/history/dependencies.added.xml
	Tree listing is saved here: /home/geronimo/geronimo/trunk/framework/configs/rmi-naming/target/history/treeListing.txt
Delete /home/geronimo/geronimo/trunk/framework/configs/rmi-naming/src/main/history/dependencies.xml
if you are happy with the dependency changes.
	at org.apache.maven.lifecycle.DefaultLifecycleExecutor.executeGoals(DefaultLifecycleExecutor.java:715)
	at org.apache.maven.lifecycle.DefaultLifecycleExecutor.executeGoalWithLifecycle(DefaultLifecycleExecutor.java:556)
	at org.apache.maven.lifecycle.DefaultLifecycleExecutor.executeGoal(DefaultLifecycleExecutor.java:535)
	at org.apache.maven.lifecycle.DefaultLifecycleExecutor.executeGoalAndHandleFailures(DefaultLifecycleExecutor.java:387)
	at org.apache.maven.lifecycle.DefaultLifecycleExecutor.executeTaskSegments(DefaultLifecycleExecutor.java:348)
	at org.apache.maven.lifecycle.DefaultLifecycleExecutor.execute(DefaultLifecycleExecutor.java:180)
	at org.apache.maven.DefaultMaven.doExecute(DefaultMaven.java:328)
	at org.apache.maven.DefaultMaven.execute(DefaultMaven.java:138)
	at org.apache.maven.cli.MavenCli.main(MavenCli.java:362)
	at org.apache.maven.cli.compat.CompatibleMain.main(CompatibleMain.java:60)
	at sun.reflect.NativeMethodAccessorImpl.invoke0(Native Method)
	at sun.reflect.NativeMethodAccessorImpl.invoke(NativeMethodAccessorImpl.java:39)
	at sun.reflect.DelegatingMethodAccessorImpl.invoke(DelegatingMethodAccessorImpl.java:25)
	at java.lang.reflect.Method.invoke(Method.java:597)
	at org.codehaus.classworlds.Launcher.launchEnhanced(Launcher.java:315)
	at org.codehaus.classworlds.Launcher.launch(Launcher.java:255)
	at org.codehaus.classworlds.Launcher.mainWithExitCode(Launcher.java:430)
	at org.codehaus.classworlds.Launcher.main(Launcher.java:375)
Caused by: org.apache.maven.plugin.MojoFailureException: Dependencies have changed:
	Added dependencies are saved here: /home/geronimo/geronimo/trunk/framework/configs/rmi-naming/target/history/dependencies.added.xml
	Tree listing is saved here: /home/geronimo/geronimo/trunk/framework/configs/rmi-naming/target/history/treeListing.txt
Delete /home/geronimo/geronimo/trunk/framework/configs/rmi-naming/src/main/history/dependencies.xml
if you are happy with the dependency changes.
	at org.apache.geronimo.mavenplugins.car.DependencyChangeMojo.saveDependencyChanges(DependencyChangeMojo.java:191)
	at org.apache.geronimo.mavenplugins.car.DependencyChangeMojo.execute(DependencyChangeMojo.java:141)
	at org.apache.maven.plugin.DefaultPluginManager.executeMojo(DefaultPluginManager.java:490)
	at org.apache.maven.lifecycle.DefaultLifecycleExecutor.executeGoals(DefaultLifecycleExecutor.java:694)
	... 17 more
[INFO] ------------------------------------------------------------------------
[INFO] Total time: 12 minutes 41 seconds
[INFO] Finished at: Fri Mar 12 15:14:01 EST 2010
[INFO] Final Memory: 377M/554M
[INFO] ------------------------------------------------------------------------

Mime
View raw message