geronimo-dev mailing list archives

Site index · List index
Message view « Date » · « Thread »
Top « Date » · « Thread »
From ga...@apache.org
Subject [BUILD] trunk: Failed for Revision: 909694
Date Sat, 13 Feb 2010 06:38:34 GMT
Geronimo Revision: 909694 built with tests included
 
See the full build-2100.log file at http://people.apache.org/builds/geronimo/server/binaries/trunk/20100213/build-2100.log
 
 
See the unit test reports at http://people.apache.org/builds/geronimo/server/binaries/trunk/20100213/unit-test-reports
 
[WARNING] Component returned which is not the same manager. Ignored. component=org.apache.maven.profiles.activation.AlwaysOnProfileActivator@5bf65bf6
[WARNING] Component returned which is not the same manager. Ignored. component=org.apache.maven.profiles.activation.OperatingSystemProfileActivator@67f067f0
[WARNING] Component returned which is not the same manager. Ignored. component=org.apache.maven.profiles.activation.AlwaysOnProfileActivator@5bf65bf6
[WARNING] Component returned which is not the same manager. Ignored. component=org.apache.maven.profiles.activation.OperatingSystemProfileActivator@67f067f0
[WARNING] Component returned which is not the same manager. Ignored. component=org.apache.maven.profiles.activation.AlwaysOnProfileActivator@5bf65bf6
[WARNING] Component returned which is not the same manager. Ignored. component=org.apache.maven.profiles.activation.OperatingSystemProfileActivator@67f067f0
[WARNING] Component returned which is not the same manager. Ignored. component=org.apache.maven.profiles.activation.AlwaysOnProfileActivator@5bf65bf6
[WARNING] Component returned which is not the same manager. Ignored. component=org.apache.maven.profiles.activation.OperatingSystemProfileActivator@67f067f0
[WARNING] Component returned which is not the same manager. Ignored. component=org.apache.maven.profiles.activation.AlwaysOnProfileActivator@5bf65bf6
[WARNING] Component returned which is not the same manager. Ignored. component=org.apache.maven.profiles.activation.OperatingSystemProfileActivator@67f067f0
[WARNING] Component returned which is not the same manager. Ignored. component=org.apache.maven.profiles.activation.AlwaysOnProfileActivator@5bf65bf6
[WARNING] Component returned which is not the same manager. Ignored. component=org.apache.maven.profiles.activation.OperatingSystemProfileActivator@67f067f0
[WARNING] Component returned which is not the same manager. Ignored. component=org.apache.maven.profiles.activation.AlwaysOnProfileActivator@5bf65bf6
[WARNING] Component returned which is not the same manager. Ignored. component=org.apache.maven.profiles.activation.OperatingSystemProfileActivator@67f067f0
[WARNING] Component returned which is not the same manager. Ignored. component=org.apache.maven.profiles.activation.AlwaysOnProfileActivator@5bf65bf6
[WARNING] Component returned which is not the same manager. Ignored. component=org.apache.maven.profiles.activation.OperatingSystemProfileActivator@67f067f0
[WARNING] Component returned which is not the same manager. Ignored. component=org.apache.maven.profiles.activation.AlwaysOnProfileActivator@5bf65bf6
[WARNING] Component returned which is not the same manager. Ignored. component=org.apache.maven.profiles.activation.OperatingSystemProfileActivator@67f067f0
[WARNING] Component returned which is not the same manager. Ignored. component=org.apache.maven.profiles.activation.AlwaysOnProfileActivator@5bf65bf6
[WARNING] Component returned which is not the same manager. Ignored. component=org.apache.maven.profiles.activation.OperatingSystemProfileActivator@67f067f0
[WARNING] Component returned which is not the same manager. Ignored. component=org.apache.maven.profiles.activation.AlwaysOnProfileActivator@5bf65bf6
[WARNING] Component returned which is not the same manager. Ignored. component=org.apache.maven.profiles.activation.OperatingSystemProfileActivator@67f067f0
[WARNING] Component returned which is not the same manager. Ignored. component=org.apache.maven.profiles.activation.AlwaysOnProfileActivator@5bf65bf6
[WARNING] Component returned which is not the same manager. Ignored. component=org.apache.maven.profiles.activation.OperatingSystemProfileActivator@67f067f0
[WARNING] Component returned which is not the same manager. Ignored. component=org.apache.maven.profiles.activation.AlwaysOnProfileActivator@5bf65bf6
[INFO] [surefire:test {execution: default-test}]
[WARNING] Component returned which is not the same manager. Ignored. component=org.apache.maven.profiles.activation.OperatingSystemProfileActivator@67f067f0
[WARNING] Component returned which is not the same manager. Ignored. component=org.apache.maven.profiles.activation.AlwaysOnProfileActivator@5bf65bf6
[INFO] Surefire report directory: /home/geronimo/geronimo/trunk/plugins/jetty8/geronimo-jetty8/target/surefire-reports

-------------------------------------------------------
 T E S T S
-------------------------------------------------------
Running org.apache.geronimo.jetty8.connector.ConnectorGBeanTest
Tests run: 1, Failures: 0, Errors: 0, Skipped: 0, Time elapsed: 0.264 sec
Running org.apache.geronimo.jetty8.connector.HTTPConnectorTest
Tests run: 1, Failures: 0, Errors: 0, Skipped: 0, Time elapsed: 0.108 sec
Running org.apache.geronimo.jetty8.GBeanInfoTest
Tests run: 2, Failures: 0, Errors: 0, Skipped: 0, Time elapsed: 0.229 sec
Running org.apache.geronimo.jetty8.security.BuiltInAuthMethodTest
Tests run: 1, Failures: 0, Errors: 0, Skipped: 0, Time elapsed: 0.008 sec
Running org.apache.geronimo.jetty8.SecurityTest
Tests run: 1, Failures: 0, Errors: 0, Skipped: 0, Time elapsed: 1.189 sec
Running org.apache.geronimo.jetty8.ClassLoaderTest
Tests run: 1, Failures: 0, Errors: 0, Skipped: 0, Time elapsed: 0.007 sec
Running org.apache.geronimo.jetty8.StatTest
Tests run: 2, Failures: 0, Errors: 0, Skipped: 0, Time elapsed: 14.003 sec
Running org.apache.geronimo.jetty8.ApplicationTest
Tests run: 2, Failures: 0, Errors: 1, Skipped: 0, Time elapsed: 2.511 sec <<< FAILURE!
Running org.apache.geronimo.jetty8.ContainerTest
Tests run: 3, Failures: 0, Errors: 0, Skipped: 0, Time elapsed: 3.079 sec

Results :

Tests in error: 
  testApplicationWithSessionHandler(org.apache.geronimo.jetty8.ApplicationTest)

Tests run: 14, Failures: 0, Errors: 1, Skipped: 0

[INFO] ------------------------------------------------------------------------
[ERROR] BUILD FAILURE
[INFO] ------------------------------------------------------------------------
[INFO] There are test failures.

Please refer to /home/geronimo/geronimo/trunk/plugins/jetty8/geronimo-jetty8/target/surefire-reports
for the individual test results.
[INFO] ------------------------------------------------------------------------
[INFO] Trace
org.apache.maven.BuildFailureException: There are test failures.

Please refer to /home/geronimo/geronimo/trunk/plugins/jetty8/geronimo-jetty8/target/surefire-reports
for the individual test results.
	at org.apache.maven.lifecycle.DefaultLifecycleExecutor.executeGoals(DefaultLifecycleExecutor.java:715)
	at org.apache.maven.lifecycle.DefaultLifecycleExecutor.executeGoalWithLifecycle(DefaultLifecycleExecutor.java:556)
	at org.apache.maven.lifecycle.DefaultLifecycleExecutor.executeGoal(DefaultLifecycleExecutor.java:535)
	at org.apache.maven.lifecycle.DefaultLifecycleExecutor.executeGoalAndHandleFailures(DefaultLifecycleExecutor.java:387)
	at org.apache.maven.lifecycle.DefaultLifecycleExecutor.executeTaskSegments(DefaultLifecycleExecutor.java:348)
	at org.apache.maven.lifecycle.DefaultLifecycleExecutor.execute(DefaultLifecycleExecutor.java:180)
	at org.apache.maven.DefaultMaven.doExecute(DefaultMaven.java:328)
	at org.apache.maven.DefaultMaven.execute(DefaultMaven.java:138)
	at org.apache.maven.cli.MavenCli.main(MavenCli.java:362)
	at org.apache.maven.cli.compat.CompatibleMain.main(CompatibleMain.java:60)
	at sun.reflect.NativeMethodAccessorImpl.invoke0(Native Method)
	at sun.reflect.NativeMethodAccessorImpl.invoke(NativeMethodAccessorImpl.java:39)
	at sun.reflect.DelegatingMethodAccessorImpl.invoke(DelegatingMethodAccessorImpl.java:37)
	at java.lang.reflect.Method.invoke(Method.java:599)
	at org.codehaus.classworlds.Launcher.launchEnhanced(Launcher.java:315)
	at org.codehaus.classworlds.Launcher.launch(Launcher.java:255)
	at org.codehaus.classworlds.Launcher.mainWithExitCode(Launcher.java:430)
	at org.codehaus.classworlds.Launcher.main(Launcher.java:375)
Caused by: org.apache.maven.plugin.MojoFailureException: There are test failures.

Please refer to /home/geronimo/geronimo/trunk/plugins/jetty8/geronimo-jetty8/target/surefire-reports
for the individual test results.
	at org.apache.maven.plugin.surefire.SurefirePlugin.execute(SurefirePlugin.java:575)
	at org.apache.maven.plugin.DefaultPluginManager.executeMojo(DefaultPluginManager.java:490)
	at org.apache.maven.lifecycle.DefaultLifecycleExecutor.executeGoals(DefaultLifecycleExecutor.java:694)
	... 17 more
[INFO] ------------------------------------------------------------------------
[INFO] Total time: 263 minutes 48 seconds
[INFO] Finished at: Sat Feb 13 01:27:58 EST 2010
[INFO] Final Memory: 1228M/1536M
[INFO] ------------------------------------------------------------------------

Mime
View raw message