geronimo-dev mailing list archives

Site index · List index
Message view « Date » · « Thread »
Top « Date » · « Thread »
From ga...@apache.org
Subject [BUILD] branches/2.1: Failed for Revision: 908364
Date Wed, 10 Feb 2010 14:22:19 GMT
Geronimo Revision: 908364 built with tests included
 
See the full build-0200.log file at http://people.apache.org/builds/geronimo/server/binaries/2.1/20100210/build-0200.log
 
Download the binaries from http://people.apache.org/builds/geronimo/server/binaries/2.1/20100210
[INFO] BUILD SUCCESSFUL
[INFO] ------------------------------------------------------------------------
[INFO] Total time: 318 minutes 44 seconds
[INFO] Finished at: Wed Feb 10 07:23:54 EST 2010
[INFO] Final Memory: 303M/783M
[INFO] ------------------------------------------------------------------------
 
TESTSUITE RESULTS (Failures only)
=================================
 
Assembly: tomcat
=================================
See full test results and logs at http://people.apache.org/builds/geronimo/server/binaries/2.1/20100210/logs-0200-tomcat/
 
[INFO] Running commands-testsuite.jaxws
[INFO] Tests run: 2, Failures: 2, Errors: 0, Skipped: 0, Time elapsed: 0.729 sec <<<
FAILURE!
--
[INFO] Running org.apache.geronimo.testsuite.testset.JaxWSTest
[INFO] Tests run: 7, Failures: 7, Errors: 0, Skipped: 0, Time elapsed: 0.385 sec <<<
FAILURE!
[INFO] Running org.apache.geronimo.testsuite.testset.ClientJAXWSTest
[INFO] Tests run: 1, Failures: 1, Errors: 0, Skipped: 0, Time elapsed: 0.167 sec <<<
FAILURE!
[INFO] Running org.apache.geronimo.testsuite.testset.JaxWSTest
[INFO] Tests run: 4, Failures: 3, Errors: 0, Skipped: 0, Time elapsed: 0.449 sec <<<
FAILURE!
--
[INFO] Running org.apache.geronimo.testsuite.testset.JaxWSTest
[INFO] Tests run: 6, Failures: 6, Errors: 0, Skipped: 0, Time elapsed: 0.263 sec <<<
FAILURE!
--
[INFO] Running org.apache.geronimo.testsuite.testset.WSTest
[INFO] Tests run: 4, Failures: 4, Errors: 0, Skipped: 0, Time elapsed: 0.231 sec <<<
FAILURE!
 
Assembly: jetty
=================================
See full test results and logs at http://people.apache.org/builds/geronimo/server/binaries/2.1/20100210/logs-0200-jetty/
 
[INFO] Running commands-testsuite.jaxws
[INFO] Tests run: 2, Failures: 2, Errors: 0, Skipped: 0, Time elapsed: 0.814 sec <<<
FAILURE!
--
[INFO] Running org.apache.geronimo.testsuite.testset.JaxWSRestTest
[INFO] Tests run: 2, Failures: 1, Errors: 0, Skipped: 1, Time elapsed: 0.202 sec <<<
FAILURE!
 
Samples: branches/2.1
=================================
Log: http://people.apache.org/builds/geronimo/server/binaries/2.1/20100210/samples-0200.log
 
Build status: FAILED
 

Mime
View raw message