geronimo-dev mailing list archives

Site index · List index
Message view « Date » · « Thread »
Top « Date » · « Thread »
From ga...@apache.org
Subject [BUILD] trunk: Failed for Revision: 902245
Date Fri, 22 Jan 2010 22:35:31 GMT
Geronimo Revision: 902245 built with tests included
 
See the full build-1500.log file at http://people.apache.org/builds/geronimo/server/binaries/trunk/20100122/build-1500.log
 
 
See the unit test reports at http://people.apache.org/builds/geronimo/server/binaries/trunk/20100122/unit-test-reports
 
[INFO] Surefire report directory: /home/geronimo/geronimo/trunk/plugins/j2ee/geronimo-web-2.5-builder/target/surefire-reports

-------------------------------------------------------
 T E S T S
-------------------------------------------------------
Running org.apache.geronimo.web.deployment.GenericToSpecificPlanConverterTest
Tests run: 4, Failures: 0, Errors: 0, Skipped: 0, Time elapsed: 0.576 sec
Running org.apache.geronimo.web25.deployment.security.SecurityConfigTest
Tests run: 1, Failures: 0, Errors: 0, Skipped: 0, Time elapsed: 0.104 sec
Running org.apache.geronimo.web25.deployment.security.SpecSecurityParsingTest
Tests run: 5, Failures: 0, Errors: 0, Skipped: 0, Time elapsed: 0.097 sec
Running org.apache.geronimo.web25.deployment.SchemaConversionTest
Tests run: 6, Failures: 0, Errors: 0, Skipped: 0, Time elapsed: 0.388 sec
Running org.apache.geronimo.web.deployment.WebAppDConfigTest
Tests run: 2, Failures: 0, Errors: 0, Skipped: 0, Time elapsed: 0.057 sec

Results :

Tests run: 18, Failures: 0, Errors: 0, Skipped: 0

[INFO] [bundle:bundle {execution: default-bundle}]
[INFO] [geronimo-osgi:verify-manifest {execution: verify-manifest}]
[INFO] Resolving OSGi bundle: org.apache.geronimo.modules.geronimo-web-2.5-builder
[INFO] OSGi bundle is resolved: org.apache.geronimo.modules.geronimo-web-2.5-builder
[INFO] [ianal:verify-legal-files {execution: default}]
[INFO] Checking legal files in: geronimo-web-2.5-builder-3.0-SNAPSHOT.jar
[INFO] [install:install {execution: default-install}]
[INFO] Installing /home/geronimo/geronimo/trunk/plugins/j2ee/geronimo-web-2.5-builder/target/geronimo-web-2.5-builder-3.0-SNAPSHOT.jar
to /home/geronimo/.m2/repository/org/apache/geronimo/modules/geronimo-web-2.5-builder/3.0-SNAPSHOT/geronimo-web-2.5-builder-3.0-SNAPSHOT.jar
[INFO] [bundle:install {execution: default-install}]
[INFO] Parsing file:/home/geronimo/.m2/repository/repository.xml
[INFO] Installing org/apache/geronimo/modules/geronimo-web-2.5-builder/3.0-SNAPSHOT/geronimo-web-2.5-builder-3.0-SNAPSHOT.jar
[INFO] Writing OBR metadata
[INFO] ------------------------------------------------------------------------
[INFO] Building Geronimo Plugins, J2EE :: Deployer
[INFO]    task-segment: [install]
[INFO] ------------------------------------------------------------------------
[INFO] [genesis:validate-configuration {execution: default}]
[INFO] snapshot org.apache.geronimo.modules:geronimo-web-2.5-builder:3.0-SNAPSHOT: checking
for updates from ops4j.snapshots
[INFO] snapshot org.apache.geronimo.modules:geronimo-web-2.5-builder:3.0-SNAPSHOT: checking
for updates from codehaus.snapshots
[INFO] snapshot org.apache.geronimo.modules:geronimo-web-2.5-builder:3.0-SNAPSHOT: checking
for updates from apache.snapshots
[INFO] [enforcer:enforce {execution: default}]
[INFO] [remote-resources:process {execution: default}]
[INFO] [dependency:unpack {execution: default}]
[INFO] [resources:resources {execution: default-resources}]
[INFO] Using 'UTF-8' encoding to copy filtered resources.
[INFO] skip non existing resourceDirectory /home/geronimo/geronimo/trunk/plugins/j2ee/j2ee-deployer/src/main/resources
[INFO] skip non existing resourceDirectory /home/geronimo/geronimo/trunk/plugins/j2ee/j2ee-deployer/src/main/filtered-resources
[INFO] Copying 3 resources
[INFO] [car:validate-configuration {execution: default-validate-configuration}]
[INFO] [car:prepare-plan {execution: default-prepare-plan}]
[INFO] Generated: /home/geronimo/geronimo/trunk/plugins/j2ee/j2ee-deployer/target/work/plan.xml
[INFO] [car:verify-no-dependency-change {execution: default-verify-no-dependency-change}]
[INFO] ------------------------------------------------------------------------
[ERROR] BUILD FAILURE
[INFO] ------------------------------------------------------------------------
[INFO] Dependencies have changed:
	Added dependencies are saved here: /home/geronimo/geronimo/trunk/plugins/j2ee/j2ee-deployer/target/history/dependencies.added.xml
	Removed dependencies are saved here: /home/geronimo/geronimo/trunk/plugins/j2ee/j2ee-deployer/target/history/dependencies.removed.xml
	Tree listing is saved here: /home/geronimo/geronimo/trunk/plugins/j2ee/j2ee-deployer/target/history/treeListing.txt
Delete /home/geronimo/geronimo/trunk/plugins/j2ee/j2ee-deployer/src/main/history/dependencies.xml
if you are happy with the dependency changes.
[INFO] ------------------------------------------------------------------------
[INFO] Trace
org.apache.maven.BuildFailureException: Dependencies have changed:
	Added dependencies are saved here: /home/geronimo/geronimo/trunk/plugins/j2ee/j2ee-deployer/target/history/dependencies.added.xml
	Removed dependencies are saved here: /home/geronimo/geronimo/trunk/plugins/j2ee/j2ee-deployer/target/history/dependencies.removed.xml
	Tree listing is saved here: /home/geronimo/geronimo/trunk/plugins/j2ee/j2ee-deployer/target/history/treeListing.txt
Delete /home/geronimo/geronimo/trunk/plugins/j2ee/j2ee-deployer/src/main/history/dependencies.xml
if you are happy with the dependency changes.
	at org.apache.maven.lifecycle.DefaultLifecycleExecutor.executeGoals(DefaultLifecycleExecutor.java:715)
	at org.apache.maven.lifecycle.DefaultLifecycleExecutor.executeGoalWithLifecycle(DefaultLifecycleExecutor.java:556)
	at org.apache.maven.lifecycle.DefaultLifecycleExecutor.executeGoal(DefaultLifecycleExecutor.java:535)
	at org.apache.maven.lifecycle.DefaultLifecycleExecutor.executeGoalAndHandleFailures(DefaultLifecycleExecutor.java:387)
	at org.apache.maven.lifecycle.DefaultLifecycleExecutor.executeTaskSegments(DefaultLifecycleExecutor.java:348)
	at org.apache.maven.lifecycle.DefaultLifecycleExecutor.execute(DefaultLifecycleExecutor.java:180)
	at org.apache.maven.DefaultMaven.doExecute(DefaultMaven.java:328)
	at org.apache.maven.DefaultMaven.execute(DefaultMaven.java:138)
	at org.apache.maven.cli.MavenCli.main(MavenCli.java:362)
	at org.apache.maven.cli.compat.CompatibleMain.main(CompatibleMain.java:60)
	at sun.reflect.NativeMethodAccessorImpl.invoke0(Native Method)
	at sun.reflect.NativeMethodAccessorImpl.invoke(NativeMethodAccessorImpl.java:39)
	at sun.reflect.DelegatingMethodAccessorImpl.invoke(DelegatingMethodAccessorImpl.java:25)
	at java.lang.reflect.Method.invoke(Method.java:597)
	at org.codehaus.classworlds.Launcher.launchEnhanced(Launcher.java:315)
	at org.codehaus.classworlds.Launcher.launch(Launcher.java:255)
	at org.codehaus.classworlds.Launcher.mainWithExitCode(Launcher.java:430)
	at org.codehaus.classworlds.Launcher.main(Launcher.java:375)
Caused by: org.apache.maven.plugin.MojoFailureException: Dependencies have changed:
	Added dependencies are saved here: /home/geronimo/geronimo/trunk/plugins/j2ee/j2ee-deployer/target/history/dependencies.added.xml
	Removed dependencies are saved here: /home/geronimo/geronimo/trunk/plugins/j2ee/j2ee-deployer/target/history/dependencies.removed.xml
	Tree listing is saved here: /home/geronimo/geronimo/trunk/plugins/j2ee/j2ee-deployer/target/history/treeListing.txt
Delete /home/geronimo/geronimo/trunk/plugins/j2ee/j2ee-deployer/src/main/history/dependencies.xml
if you are happy with the dependency changes.
	at org.apache.geronimo.mavenplugins.car.DependencyChangeMojo.saveDependencyChanges(DependencyChangeMojo.java:170)
	at org.apache.geronimo.mavenplugins.car.DependencyChangeMojo.execute(DependencyChangeMojo.java:129)
	at org.apache.maven.plugin.DefaultPluginManager.executeMojo(DefaultPluginManager.java:490)
	at org.apache.maven.lifecycle.DefaultLifecycleExecutor.executeGoals(DefaultLifecycleExecutor.java:694)
	... 17 more
[INFO] ------------------------------------------------------------------------
[INFO] Total time: 146 minutes 28 seconds
[INFO] Finished at: Fri Jan 22 17:28:45 EST 2010
[INFO] Final Memory: 301M/524M
[INFO] ------------------------------------------------------------------------

Mime
View raw message