geronimo-dev mailing list archives

Site index · List index
Message view « Date » · « Thread »
Top « Date » · « Thread »
From ga...@apache.org
Subject [BUILD] branches/2.2: Failed for Revision: 887575
Date Sat, 05 Dec 2009 19:06:00 GMT
Geronimo Revision: 887575 built with tests included
 
See the full build-1400.log file at http://people.apache.org/builds/geronimo/server/binaries/2.2/20091205/build-1400.log
 
 
See the unit test reports at http://people.apache.org/builds/geronimo/server/binaries/2.2/20091205/unit-test-reports
 
Downloading: http://repo.exist.com/maven2/org/codehaus/groovy/maven/gmaven-common/1.0-rc-2/gmaven-common-1.0-rc-2.jar
14K downloaded
Downloading: http://nexus.openqa.org/content/repositories/releases/org/codehaus/groovy/maven/support/ant-launcher-1.7.0/1.0-rc-2/ant-launcher-1.7.0-1.0-rc-2.jar
Downloading: http://repo.exist.com/maven2/org/codehaus/groovy/maven/support/ant-launcher-1.7.0/1.0-rc-2/ant-launcher-1.7.0-1.0-rc-2.jar
18K downloaded
Downloading: http://nexus.openqa.org/content/repositories/releases/org/seleniumhq/selenium/core/selenium-core/1.0-beta-2/selenium-core-1.0-beta-2.jar
1620K downloaded
Downloading: http://nexus.openqa.org/content/repositories/releases/org/seleniumhq/selenium/server/selenium-server/1.0-beta-2/selenium-server-1.0-beta-2-standalone.jar
5146K downloaded
Downloading: http://nexus.openqa.org/content/repositories/releases/org/seleniumhq/selenium/server/selenium-server-coreless/1.0-beta-2/selenium-server-coreless-1.0-beta-2.jar
529K downloaded
Downloading: http://nexus.openqa.org/content/repositories/releases/ant/ant/1.6.5/ant-1.6.5.jar
Downloading: http://nexus.openqa.org/content/repositories/thirdparty/ant/ant/1.6.5/ant-1.6.5.jar
Downloading: http://repo.exist.com/maven2/ant/ant/1.6.5/ant-1.6.5.jar
1009K downloaded
Downloading: http://nexus.openqa.org/content/repositories/releases/jetty/org.mortbay.jetty/5.1.10/org.mortbay.jetty-5.1.10.jar
Downloading: http://nexus.openqa.org/content/repositories/thirdparty/jetty/org.mortbay.jetty/5.1.10/org.mortbay.jetty-5.1.10.jar
Downloading: http://repo.exist.com/maven2/jetty/org.mortbay.jetty/5.1.10/org.mortbay.jetty-5.1.10.jar
660K downloaded
Downloading: http://nexus.openqa.org/content/repositories/releases/commons-logging/commons-logging/1.0.4/commons-logging-1.0.4.jar
Downloading: http://nexus.openqa.org/content/repositories/thirdparty/commons-logging/commons-logging/1.0.4/commons-logging-1.0.4.jar
Downloading: http://repo.exist.com/maven2/commons-logging/commons-logging/1.0.4/commons-logging-1.0.4.jar
37K downloaded
Downloading: http://nexus.openqa.org/content/repositories/releases/commons-codec/commons-codec/1.3/commons-codec-1.3.jar
Downloading: http://nexus.openqa.org/content/repositories/thirdparty/commons-codec/commons-codec/1.3/commons-codec-1.3.jar
Downloading: http://repo.exist.com/maven2/commons-codec/commons-codec/1.3/commons-codec-1.3.jar
45K downloaded
Downloading: http://nexus.openqa.org/content/repositories/releases/javax/servlet/servlet-api/2.4/servlet-api-2.4.jar
Downloading: http://nexus.openqa.org/content/repositories/thirdparty/javax/servlet/servlet-api/2.4/servlet-api-2.4.jar
Downloading: http://repo.exist.com/maven2/javax/servlet/servlet-api/2.4/servlet-api-2.4.jar
95K downloaded
Downloading: http://nexus.openqa.org/content/repositories/releases/bouncycastle/bcprov-jdk15/135/bcprov-jdk15-135.jar
Downloading: http://nexus.openqa.org/content/repositories/thirdparty/bouncycastle/bcprov-jdk15/135/bcprov-jdk15-135.jar
1239K downloaded
Downloading: http://nexus.openqa.org/content/repositories/releases/org/seleniumhq/selenium/server/selenium-server/1.0-beta-2/selenium-server-1.0-beta-2.jar
3K downloaded
Downloading: http://nexus.openqa.org/content/repositories/releases/org/testng/testng/5.8/testng-5.8-jdk15.jar
Downloading: http://repo.exist.com/maven2/org/testng/testng/5.8/testng-5.8-jdk15.jar
823K downloaded
[INFO] [enforcer:enforce {execution: default}]
[INFO] [remote-resources:process {execution: default}]
[INFO] [resources:resources]
[INFO] Using 'UTF-8' encoding to copy filtered resources.
[INFO] skip non existing resourceDirectory /home/geronimo/geronimo/2.2/testsupport/testsupport-selenium/src/main/resources
[INFO] skip non existing resourceDirectory /home/geronimo/geronimo/2.2/testsupport/testsupport-selenium/src/main/filtered-resources
[INFO] Copying 3 resources
[INFO] [compiler:compile]
[INFO] Compiling 3 source files to /home/geronimo/geronimo/2.2/testsupport/testsupport-selenium/target/classes
[INFO] [resources:testResources]
[INFO] Using 'UTF-8' encoding to copy filtered resources.
[INFO] skip non existing resourceDirectory /home/geronimo/geronimo/2.2/testsupport/testsupport-selenium/src/test/resources
[INFO] skip non existing resourceDirectory /home/geronimo/geronimo/2.2/testsupport/testsupport-selenium/src/test/filtered-resources
[INFO] Copying 3 resources
[INFO] [compiler:testCompile]
[INFO] No sources to compile
[INFO] [surefire:test]
Downloading: http://repo.exist.com/maven2/org/apache/maven/surefire/surefire-testng/2.4.3/surefire-testng-2.4.3.pom
Downloading: http://repo.exist.com/maven2/org/apache/maven/surefire/surefire-testng/2.4.3/surefire-testng-2.4.3.jar
25K downloaded
[INFO] Surefire report directory: /home/geronimo/geronimo/2.2/testsupport/testsupport-selenium/target/surefire-reports
[INFO] ------------------------------------------------------------------------
[ERROR] BUILD FAILURE
[INFO] ------------------------------------------------------------------------
[INFO] There are test failures.

Please refer to /home/geronimo/geronimo/2.2/testsupport/testsupport-selenium/target/surefire-reports
for the individual test results.
[INFO] ------------------------------------------------------------------------
[INFO] Trace
org.apache.maven.BuildFailureException: There are test failures.

Please refer to /home/geronimo/geronimo/2.2/testsupport/testsupport-selenium/target/surefire-reports
for the individual test results.
	at org.apache.maven.lifecycle.DefaultLifecycleExecutor.executeGoals(DefaultLifecycleExecutor.java:580)
	at org.apache.maven.lifecycle.DefaultLifecycleExecutor.executeGoalWithLifecycle(DefaultLifecycleExecutor.java:500)
	at org.apache.maven.lifecycle.DefaultLifecycleExecutor.executeGoal(DefaultLifecycleExecutor.java:479)
	at org.apache.maven.lifecycle.DefaultLifecycleExecutor.executeGoalAndHandleFailures(DefaultLifecycleExecutor.java:331)
	at org.apache.maven.lifecycle.DefaultLifecycleExecutor.executeTaskSegments(DefaultLifecycleExecutor.java:292)
	at org.apache.maven.lifecycle.DefaultLifecycleExecutor.execute(DefaultLifecycleExecutor.java:142)
	at org.apache.maven.DefaultMaven.doExecute(DefaultMaven.java:336)
	at org.apache.maven.DefaultMaven.execute(DefaultMaven.java:129)
	at org.apache.maven.cli.MavenCli.main(MavenCli.java:301)
	at sun.reflect.NativeMethodAccessorImpl.invoke0(Native Method)
	at sun.reflect.NativeMethodAccessorImpl.invoke(NativeMethodAccessorImpl.java:39)
	at sun.reflect.DelegatingMethodAccessorImpl.invoke(DelegatingMethodAccessorImpl.java:25)
	at java.lang.reflect.Method.invoke(Method.java:585)
	at org.codehaus.classworlds.Launcher.launchEnhanced(Launcher.java:315)
	at org.codehaus.classworlds.Launcher.launch(Launcher.java:255)
	at org.codehaus.classworlds.Launcher.mainWithExitCode(Launcher.java:430)
	at org.codehaus.classworlds.Launcher.main(Launcher.java:375)
Caused by: org.apache.maven.plugin.MojoFailureException: There are test failures.

Please refer to /home/geronimo/geronimo/2.2/testsupport/testsupport-selenium/target/surefire-reports
for the individual test results.
	at org.apache.maven.plugin.surefire.SurefirePlugin.execute(SurefirePlugin.java:575)
	at org.apache.maven.plugin.DefaultPluginManager.executeMojo(DefaultPluginManager.java:453)
	at org.apache.maven.lifecycle.DefaultLifecycleExecutor.executeGoals(DefaultLifecycleExecutor.java:559)
	... 16 more
[INFO] ------------------------------------------------------------------------
[INFO] Total time: 8 minutes 34 seconds
[INFO] Finished at: Sat Dec 05 14:17:33 EST 2009
[INFO] Final Memory: 160M/544M
[INFO] ------------------------------------------------------------------------

Mime
View raw message