geronimo-dev mailing list archives

Site index · List index
Message view « Date » · « Thread »
Top « Date » · « Thread »
From ga...@apache.org
Subject [BUILD] branches/2.1: Failed for Revision: 886061
Date Wed, 02 Dec 2009 07:22:42 GMT
Geronimo Revision: 886061 built with tests included
 
See the full build-0200.log file at http://people.apache.org/builds/geronimo/server/binaries/2.1/20091202/build-0200.log
 
 
See the unit test reports at http://people.apache.org/builds/geronimo/server/binaries/2.1/20091202/unit-test-reports
 
1K downloaded
Downloading: http://people.apache.org/repo/m2-incubating-repository//org/apache/geronimo/gshell/support/gshell-support/1.0-alpha-1/gshell-support-1.0-alpha-1.pom
Downloading: http://repo.exist.com/maven2/org/apache/geronimo/gshell/support/gshell-support/1.0-alpha-1/gshell-support-1.0-alpha-1.pom
1K downloaded
Downloading: http://people.apache.org/repo/m2-incubating-repository//org/apache/geronimo/gshell/support/gshell-ansi/1.0-alpha-1/gshell-ansi-1.0-alpha-1.pom
Downloading: http://repo.exist.com/maven2/org/apache/geronimo/gshell/support/gshell-ansi/1.0-alpha-1/gshell-ansi-1.0-alpha-1.pom
1K downloaded
Downloading: http://people.apache.org/repo/m2-incubating-repository//org/apache/geronimo/gshell/support/gshell-i18n/1.0-alpha-1/gshell-i18n-1.0-alpha-1.pom
Downloading: http://repo.exist.com/maven2/org/apache/geronimo/gshell/support/gshell-i18n/1.0-alpha-1/gshell-i18n-1.0-alpha-1.pom
1K downloaded
Downloading: http://people.apache.org/repo/m2-incubating-repository//org/apache/geronimo/gshell/support/gshell-clp/1.0-alpha-1/gshell-clp-1.0-alpha-1.pom
Downloading: http://repo.exist.com/maven2/org/apache/geronimo/gshell/support/gshell-clp/1.0-alpha-1/gshell-clp-1.0-alpha-1.pom
1K downloaded
Downloading: http://people.apache.org/repo/m2-incubating-repository//org/apache/geronimo/gshell/support/gshell-prefs/1.0-alpha-1/gshell-prefs-1.0-alpha-1.pom
Downloading: http://repo.exist.com/maven2/org/apache/geronimo/gshell/support/gshell-prefs/1.0-alpha-1/gshell-prefs-1.0-alpha-1.pom
1K downloaded
Downloading: http://people.apache.org/repo/m2-incubating-repository//org/apache/geronimo/gshell/gshell-core/1.0-alpha-1/gshell-core-1.0-alpha-1.pom
Downloading: http://repo.exist.com/maven2/org/apache/geronimo/gshell/gshell-core/1.0-alpha-1/gshell-core-1.0-alpha-1.pom
4K downloaded
Downloading: http://people.apache.org/repo/m2-incubating-repository//org/apache/geronimo/gshell/gshell-parser/1.0-alpha-1/gshell-parser-1.0-alpha-1.pom
Downloading: http://repo.exist.com/maven2/org/apache/geronimo/gshell/gshell-parser/1.0-alpha-1/gshell-parser-1.0-alpha-1.pom
4K downloaded
Downloading: http://people.apache.org/repo/m2-incubating-repository//org/slf4j/slf4j-simple/1.4.3/slf4j-simple-1.4.3.jar
Downloading: http://repo.exist.com/maven2/org/slf4j/slf4j-simple/1.4.3/slf4j-simple-1.4.3.jar
7K downloaded
Downloading: http://people.apache.org/repo/m2-incubating-repository//org/apache/geronimo/gshell/gshell-command-api/1.0-alpha-1/gshell-command-api-1.0-alpha-1.jar
Downloading: http://repo.exist.com/maven2/org/apache/geronimo/gshell/gshell-command-api/1.0-alpha-1/gshell-command-api-1.0-alpha-1.jar
19K downloaded
Downloading: http://people.apache.org/repo/m2-incubating-repository//org/apache/geronimo/gshell/support/gshell-common/1.0-alpha-1/gshell-common-1.0-alpha-1.jar
Downloading: http://repo.exist.com/maven2/org/apache/geronimo/gshell/support/gshell-common/1.0-alpha-1/gshell-common-1.0-alpha-1.jar
47K downloaded
Downloading: http://people.apache.org/repo/m2-incubating-repository//org/apache/geronimo/gshell/support/gshell-ansi/1.0-alpha-1/gshell-ansi-1.0-alpha-1.jar
Downloading: http://repo.exist.com/maven2/org/apache/geronimo/gshell/support/gshell-ansi/1.0-alpha-1/gshell-ansi-1.0-alpha-1.jar
14K downloaded
Downloading: http://people.apache.org/repo/m2-incubating-repository//org/apache/geronimo/gshell/support/gshell-i18n/1.0-alpha-1/gshell-i18n-1.0-alpha-1.jar
Downloading: http://repo.exist.com/maven2/org/apache/geronimo/gshell/support/gshell-i18n/1.0-alpha-1/gshell-i18n-1.0-alpha-1.jar
9K downloaded
Downloading: http://people.apache.org/repo/m2-incubating-repository//org/apache/geronimo/gshell/support/gshell-clp/1.0-alpha-1/gshell-clp-1.0-alpha-1.jar
Downloading: http://repo.exist.com/maven2/org/apache/geronimo/gshell/support/gshell-clp/1.0-alpha-1/gshell-clp-1.0-alpha-1.jar
45K downloaded
Downloading: http://people.apache.org/repo/m2-incubating-repository//org/apache/geronimo/gshell/support/gshell-prefs/1.0-alpha-1/gshell-prefs-1.0-alpha-1.jar
Downloading: http://repo.exist.com/maven2/org/apache/geronimo/gshell/support/gshell-prefs/1.0-alpha-1/gshell-prefs-1.0-alpha-1.jar
10K downloaded
Downloading: http://people.apache.org/repo/m2-incubating-repository//org/apache/geronimo/gshell/gshell-core/1.0-alpha-1/gshell-core-1.0-alpha-1.jar
Downloading: http://repo.exist.com/maven2/org/apache/geronimo/gshell/gshell-core/1.0-alpha-1/gshell-core-1.0-alpha-1.jar
97K downloaded
Downloading: http://people.apache.org/repo/m2-incubating-repository//org/apache/geronimo/gshell/gshell-parser/1.0-alpha-1/gshell-parser-1.0-alpha-1.jar
Downloading: http://repo.exist.com/maven2/org/apache/geronimo/gshell/gshell-parser/1.0-alpha-1/gshell-parser-1.0-alpha-1.jar
35K downloaded
[INFO] [enforcer:enforce {execution: default}]
[INFO] [groovy:generateStubs {execution: default}]
[INFO]  Generated 23 Java stubs
[INFO] [tools:copy-legal-files {execution: install-legal-files}]
[INFO] Created dir: /home/geronimo/geronimo/2.1/framework/modules/geronimo-commands/target/classes/META-INF
[INFO] Copying 2 files to /home/geronimo/geronimo/2.1/framework/modules/geronimo-commands/target/classes/META-INF
[INFO] [resources:resources]
[INFO] Using default encoding to copy filtered resources.
[INFO] [compiler:compile]
[INFO] Compiling 29 source files to /home/geronimo/geronimo/2.1/framework/modules/geronimo-commands/target/classes
[INFO] ------------------------------------------------------------------------
[ERROR] BUILD FAILURE
[INFO] ------------------------------------------------------------------------
[INFO] Compilation failure

/home/geronimo/geronimo/2.1/framework/modules/geronimo-commands/src/main/groovy/org/apache/geronimo/commands/GeronimoBranding.java:[35,49]
package org.codehaus.plexus.component.annotations does not exist

/home/geronimo/geronimo/2.1/framework/modules/geronimo-commands/src/main/groovy/org/apache/geronimo/commands/GeronimoBranding.java:[36,49]
package org.codehaus.plexus.component.annotations does not exist


[INFO] ------------------------------------------------------------------------
[INFO] Trace
org.apache.maven.BuildFailureException: Compilation failure
	at org.apache.maven.lifecycle.DefaultLifecycleExecutor.executeGoals(DefaultLifecycleExecutor.java:579)
	at org.apache.maven.lifecycle.DefaultLifecycleExecutor.executeGoalWithLifecycle(DefaultLifecycleExecutor.java:499)
	at org.apache.maven.lifecycle.DefaultLifecycleExecutor.executeGoal(DefaultLifecycleExecutor.java:478)
	at org.apache.maven.lifecycle.DefaultLifecycleExecutor.executeGoalAndHandleFailures(DefaultLifecycleExecutor.java:330)
	at org.apache.maven.lifecycle.DefaultLifecycleExecutor.executeTaskSegments(DefaultLifecycleExecutor.java:291)
	at org.apache.maven.lifecycle.DefaultLifecycleExecutor.execute(DefaultLifecycleExecutor.java:142)
	at org.apache.maven.DefaultMaven.doExecute(DefaultMaven.java:336)
	at org.apache.maven.DefaultMaven.execute(DefaultMaven.java:129)
	at org.apache.maven.cli.MavenCli.main(MavenCli.java:287)
	at sun.reflect.NativeMethodAccessorImpl.invoke0(Native Method)
	at sun.reflect.NativeMethodAccessorImpl.invoke(NativeMethodAccessorImpl.java:39)
	at sun.reflect.DelegatingMethodAccessorImpl.invoke(DelegatingMethodAccessorImpl.java:25)
	at java.lang.reflect.Method.invoke(Method.java:585)
	at org.codehaus.classworlds.Launcher.launchEnhanced(Launcher.java:315)
	at org.codehaus.classworlds.Launcher.launch(Launcher.java:255)
	at org.codehaus.classworlds.Launcher.mainWithExitCode(Launcher.java:430)
	at org.codehaus.classworlds.Launcher.main(Launcher.java:375)
Caused by: org.apache.maven.plugin.CompilationFailureException: Compilation failure
	at org.apache.maven.plugin.AbstractCompilerMojo.execute(AbstractCompilerMojo.java:516)
	at org.apache.maven.plugin.CompilerMojo.execute(CompilerMojo.java:114)
	at org.apache.maven.plugin.DefaultPluginManager.executeMojo(DefaultPluginManager.java:451)
	at org.apache.maven.lifecycle.DefaultLifecycleExecutor.executeGoals(DefaultLifecycleExecutor.java:558)
	... 16 more
[INFO] ------------------------------------------------------------------------
[INFO] Total time: 7 minutes 50 seconds
[INFO] Finished at: Wed Dec 02 02:33:21 EST 2009
[INFO] Final Memory: 161M/545M
[INFO] ------------------------------------------------------------------------

Mime
View raw message