geronimo-dev mailing list archives

Site index · List index
Message view « Date » · « Thread »
Top « Date » · « Thread »
From David Jencks <david_jen...@yahoo.com>
Subject Re: [BUILD] branches/2.2: Failed for Revision: 831574
Date Mon, 02 Nov 2009 07:28:57 GMT
I committed a partial fix in rev 831811 which gets ejbModuleImpl to  
initialize all the ejbDeployments as it starts.  I think the TSSLink  
and WSLink gbeans will also need dependencies on ejbModule to make  
sure they start after this initialization happens.  I'd appreciate a  
review of the committed change.

thanks
david jencks

On Nov 1, 2009, at 9:01 AM, David Jencks wrote:

> I think that the dependency direction changes for ejb singletons  
> have broken corba and ejb web services.  Looking into it.... help  
> would be welcome.
>
> For the corba problems, so far I've discovered that we really need  
> the deployment info in EjbDeployment initialized before the  
> TSSLinkGBean starts.  However, even having a dependency on  
> EjbModuleImpl is not sufficient for the EjbDeployment to be usable.   
> Is there some way that EjbModuleImpl could run through the  
> EjbDeployment objects and initialize them?
>
> thanks
> david jencks
>
> On Oct 31, 2009, at 1:18 PM, gawor@apache.org wrote:
>
>> Geronimo Revision: 831574 built with tests included
>>
>> See the full build-1400.log file at http://people.apache.org/builds/geronimo/server/binaries/2.2/20091031/build-1400.log
>>
>> Download the binaries from http://people.apache.org/builds/geronimo/server/binaries/2.2/20091031
>> [INFO] BUILD SUCCESSFUL
>> [INFO]  
>> ------------------------------------------------------------------------
>> [INFO] Total time: 40 minutes 40 seconds
>> [INFO] Finished at: Sat Oct 31 14:45:34 EDT 2009
>> [INFO] Final Memory: 322M/1015M
>> [INFO]  
>> ------------------------------------------------------------------------
>>
>> TESTSUITE RESULTS (Failures only)
>> =================================
>>
>> Assembly: tomcat
>> =================================
>> See full test results and logs at http://people.apache.org/builds/geronimo/server/binaries/2.2/20091031/logs-1400-tomcat/
>>
>>
>> [INFO] Waiting for Geronimo server...
>> [INFO] Geronimo server started in 0:00:50.797
>> [INFO] [shitty:install {execution: default}]
>> [INFO] Installing /home/geronimo/geronimo/2.2/testsuite/pom.xml to / 
>> home/geronimo/.m2/repository/org/apache/geronimo/testsuite/ 
>> testsuite/testing/testsuite-testing.pom
>> [INFO] [shitty:test {execution: default}]
>> [INFO] Starting 36 test builds
>> [INFO]
>> [INFO]  
>> -------------------------------------------------------------------------------
>> [INFO]
>> [INFO] commands-testsuite/deploy                  RUNNING
>> [INFO] commands-testsuite/deploy                  SUCCESS  
>> (0:01:22.391)
>> [INFO] commands-testsuite/gshell                  RUNNING
>> [INFO] commands-testsuite/gshell                  SUCCESS  
>> (0:00:39.683)
>> [INFO] commands-testsuite/jaxws                   RUNNING
>> [INFO] commands-testsuite/jaxws                   SUCCESS  
>> (0:00:45.972)
>> [INFO] commands-testsuite/shutdown                RUNNING
>> [INFO] commands-testsuite/shutdown                SUCCESS  
>> (0:00:24.215)
>> [INFO] concurrent-testsuite/concurrent-basic      RUNNING
>> [INFO] concurrent-testsuite/concurrent-basic      SUCCESS  
>> (0:06:36.063)
>> [INFO] console-testsuite/advanced                 RUNNING
>> [INFO] console-testsuite/advanced                 SUCCESS  
>> (0:01:39.190)
>> [INFO] console-testsuite/basic                    RUNNING
>> [INFO] console-testsuite/basic                    SUCCESS  
>> (0:02:03.305)
>> [INFO] corba-testsuite/corba-helloworld           RUNNING
>> [INFO] corba-testsuite/corba-helloworld           FAILURE  
>> (0:00:50.371) Java returned: 1
>> [INFO] corba-testsuite/corba-marshal              RUNNING
>> [INFO] corba-testsuite/corba-marshal              FAILURE  
>> (0:00:43.377) Java returned: 1
>> [INFO] corba-testsuite/corba-mytime               RUNNING
>> [INFO] corba-testsuite/corba-mytime               FAILURE  
>> (0:00:43.091) Java returned: 1
>> [INFO] deployment-testsuite/deployment-tests      RUNNING
>> [INFO] deployment-testsuite/deployment-tests      SUCCESS  
>> (0:00:38.182)
>> [INFO] deployment-testsuite/jca-cms-tests         RUNNING
>> [INFO] deployment-testsuite/jca-cms-tests         SUCCESS  
>> (0:00:35.599)
>> [INFO] deployment-testsuite/manifestcp-tests      RUNNING
>> [INFO] deployment-testsuite/manifestcp-tests      SUCCESS  
>> (0:00:39.983)
>> [INFO] enterprise-testsuite/ejb-tests             RUNNING
>> [INFO] enterprise-testsuite/ejb-tests             SUCCESS  
>> (0:01:07.558)
>> [INFO] enterprise-testsuite/jms-tests             RUNNING
>> [INFO] enterprise-testsuite/jms-tests             SUCCESS  
>> (0:01:20.983)
>> [INFO] enterprise-testsuite/jpa-tests             RUNNING
>> [INFO] enterprise-testsuite/jpa-tests             SUCCESS  
>> (0:01:00.172)
>> [INFO] enterprise-testsuite/sec-client-tests      RUNNING
>> [INFO] enterprise-testsuite/sec-client-tests      SUCCESS  
>> (0:00:34.514)
>> [INFO] enterprise-testsuite/sec-tests             RUNNING
>> [INFO] enterprise-testsuite/sec-tests             SUCCESS  
>> (0:01:03.167)
>> [INFO] security-testsuite/test-security           RUNNING
>> [INFO] security-testsuite/test-security           SUCCESS  
>> (0:00:57.866)
>> [INFO] web-testsuite/test-2.1-jsps                RUNNING
>> [INFO] web-testsuite/test-2.1-jsps                SUCCESS  
>> (0:00:36.912)
>> [INFO] web-testsuite/test-2.5-servlets            RUNNING
>> [INFO] web-testsuite/test-2.5-servlets            SUCCESS  
>> (0:00:35.578)
>> [INFO] web-testsuite/test-myfaces                 RUNNING
>> [INFO] web-testsuite/test-myfaces                 SUCCESS  
>> (0:00:37.124)
>> [INFO] web-testsuite/test-tomcat                  RUNNING
>> [INFO] web-testsuite/test-tomcat                  SUCCESS  
>> (0:00:28.078)
>> [INFO] web-testsuite/test-web-forward             RUNNING
>> [INFO] web-testsuite/test-web-forward             SUCCESS  
>> (0:00:43.560)
>> [INFO] web-testsuite/test-web-references          RUNNING
>> [INFO] web-testsuite/test-web-references          SUCCESS  
>> (0:00:49.398)
>> [INFO] webservices-testsuite/jaxb-tests           RUNNING
>> [INFO] webservices-testsuite/jaxb-tests           SUCCESS  
>> (0:01:11.812)
>> [INFO] webservices-testsuite/jaxr-tests           RUNNING
>> [INFO] webservices-testsuite/jaxr-tests           SUCCESS  
>> (0:01:11.935)
>> [INFO] webservices-testsuite/jaxrpc-jaxws-tests   RUNNING
>> [INFO] webservices-testsuite/jaxrpc-jaxws-tests   SUCCESS  
>> (0:00:41.085)
>> [INFO] webservices-testsuite/jaxrpc-tests         RUNNING
>> [INFO] webservices-testsuite/jaxrpc-tests         FAILURE  
>> (0:00:54.562) Java returned: 1
>> [INFO] webservices-testsuite/jaxws-catalog-tests  RUNNING
>> [INFO] webservices-testsuite/jaxws-catalog-tests  FAILURE  
>> (0:00:52.053) Java returned: 1
>> [INFO] webservices-testsuite/jaxws-mtom-tests     RUNNING
>> [INFO] webservices-testsuite/jaxws-mtom-tests     FAILURE  
>> (0:00:46.752) Java returned: 1
>> [INFO] webservices-testsuite/jaxws-provider-tests RUNNING
>> [INFO] webservices-testsuite/jaxws-provider-tests FAILURE  
>> (0:00:41.944) Java returned: 1
>> [INFO] webservices-testsuite/jaxws-tests          RUNNING
>> [INFO] webservices-testsuite/jaxws-tests          FAILURE  
>> (0:01:29.000) Java returned: 1
>> [INFO] webservices-testsuite/jaxws-wsa-tests      RUNNING
>> [INFO] webservices-testsuite/jaxws-wsa-tests      FAILURE  
>> (0:00:46.130) Java returned: 1
>> [INFO] webservices-testsuite/saaj-tests           RUNNING
>> [INFO] webservices-testsuite/saaj-tests           SUCCESS  
>> (0:00:47.359)
>> [INFO] webservices-testsuite/stax-tests           RUNNING
>> [INFO] webservices-testsuite/stax-tests           SUCCESS  
>> (0:01:12.467)
>> [INFO]
>> [INFO]  
>> -------------------------------------------------------------------------------
>> [INFO] Test Summary (0:38:11.664)
>> [INFO]     Passed: 27
>> [INFO]     Failed: 9
>> [INFO]  
>> -------------------------------------------------------------------------------
>> [INFO]
>> [INFO] The following tests failed:
>> [INFO]     * corba-testsuite/corba-helloworld - /home/geronimo/ 
>> geronimo/2.2/testsuite/corba-testsuite/corba-helloworld/build.log
>> [INFO]     * corba-testsuite/corba-marshal - /home/geronimo/ 
>> geronimo/2.2/testsuite/corba-testsuite/corba-marshal/build.log
>> [INFO]     * corba-testsuite/corba-mytime - /home/geronimo/geronimo/ 
>> 2.2/testsuite/corba-testsuite/corba-mytime/build.log
>> [INFO]     * webservices-testsuite/jaxrpc-tests - /home/geronimo/ 
>> geronimo/2.2/testsuite/webservices-testsuite/jaxrpc-tests/build.log
>> [INFO]     * webservices-testsuite/jaxws-catalog-tests - /home/ 
>> geronimo/geronimo/2.2/testsuite/webservices-testsuite/jaxws-catalog- 
>> tests/build.log
>> [INFO]     * webservices-testsuite/jaxws-mtom-tests - /home/ 
>> geronimo/geronimo/2.2/testsuite/webservices-testsuite/jaxws-mtom- 
>> tests/build.log
>> [INFO]     * webservices-testsuite/jaxws-provider-tests - /home/ 
>> geronimo/geronimo/2.2/testsuite/webservices-testsuite/jaxws- 
>> provider-tests/build.log
>> [INFO]     * webservices-testsuite/jaxws-tests - /home/geronimo/ 
>> geronimo/2.2/testsuite/webservices-testsuite/jaxws-tests/build.log
>> [INFO]     * webservices-testsuite/jaxws-wsa-tests - /home/geronimo/ 
>> geronimo/2.2/testsuite/webservices-testsuite/jaxws-wsa-tests/ 
>> build.log
>> [INFO]
>> [INFO]  
>> ------------------------------------------------------------------------
>> [ERROR] BUILD ERROR
>>
>> Assembly: jetty
>> =================================
>> See full test results and logs at http://people.apache.org/builds/geronimo/server/binaries/2.2/20091031/logs-1400-jetty/
>>
>>
>> [INFO] Geronimo server started in 0:00:53.921
>> [INFO] [shitty:install {execution: default}]
>> [INFO] Installing /home/geronimo/geronimo/2.2/testsuite/pom.xml to / 
>> home/geronimo/.m2/repository/org/apache/geronimo/testsuite/ 
>> testsuite/testing/testsuite-testing.pom
>> [INFO] [shitty:test {execution: default}]
>> [INFO] Starting 36 test builds
>> [INFO]
>> [INFO]  
>> -------------------------------------------------------------------------------
>> [INFO]
>> [INFO] commands-testsuite/deploy                  RUNNING
>> [INFO] commands-testsuite/deploy                  SUCCESS  
>> (0:01:20.488)
>> [INFO] commands-testsuite/gshell                  RUNNING
>> [INFO] commands-testsuite/gshell                  SUCCESS  
>> (0:00:39.256)
>> [INFO] commands-testsuite/jaxws                   RUNNING
>> [INFO] commands-testsuite/jaxws                   SUCCESS  
>> (0:00:44.793)
>> [INFO] commands-testsuite/shutdown                RUNNING
>> [INFO] commands-testsuite/shutdown                SUCCESS  
>> (0:00:23.458)
>> [INFO] concurrent-testsuite/concurrent-basic      RUNNING
>> [INFO] concurrent-testsuite/concurrent-basic      SUCCESS  
>> (0:06:27.744)
>> [INFO] console-testsuite/advanced                 RUNNING
>> [INFO] console-testsuite/advanced                 FAILURE  
>> (0:00:23.501) Java returned: 1
>> [INFO] console-testsuite/basic                    RUNNING
>> [INFO] console-testsuite/basic                    SUCCESS  
>> (0:02:10.299)
>> [INFO] corba-testsuite/corba-helloworld           RUNNING
>> [INFO] corba-testsuite/corba-helloworld           FAILURE  
>> (0:00:48.262) Java returned: 1
>> [INFO] corba-testsuite/corba-marshal              RUNNING
>> [INFO] corba-testsuite/corba-marshal              FAILURE  
>> (0:00:41.241) Java returned: 1
>> [INFO] corba-testsuite/corba-mytime               RUNNING
>> [INFO] corba-testsuite/corba-mytime               FAILURE  
>> (0:00:41.935) Java returned: 1
>> [INFO] deployment-testsuite/deployment-tests      RUNNING
>> [INFO] deployment-testsuite/deployment-tests      SUCCESS  
>> (0:00:38.015)
>> [INFO] deployment-testsuite/jca-cms-tests         RUNNING
>> [INFO] deployment-testsuite/jca-cms-tests         SUCCESS  
>> (0:00:34.573)
>> [INFO] deployment-testsuite/manifestcp-tests      RUNNING
>> [INFO] deployment-testsuite/manifestcp-tests      SUCCESS  
>> (0:00:40.662)
>> [INFO] enterprise-testsuite/ejb-tests             RUNNING
>> [INFO] enterprise-testsuite/ejb-tests             SUCCESS  
>> (0:00:53.480)
>> [INFO] enterprise-testsuite/jms-tests             RUNNING
>> [INFO] enterprise-testsuite/jms-tests             SUCCESS  
>> (0:01:18.677)
>> [INFO] enterprise-testsuite/jpa-tests             RUNNING
>> [INFO] enterprise-testsuite/jpa-tests             SUCCESS  
>> (0:00:49.494)
>> [INFO] enterprise-testsuite/sec-client-tests      RUNNING
>> [INFO] enterprise-testsuite/sec-client-tests      SUCCESS  
>> (0:00:36.703)
>> [INFO] enterprise-testsuite/sec-tests             RUNNING
>> [INFO] enterprise-testsuite/sec-tests             SUCCESS  
>> (0:01:01.664)
>> [INFO] security-testsuite/test-security           RUNNING
>> [INFO] security-testsuite/test-security           SUCCESS  
>> (0:00:59.102)
>> [INFO] web-testsuite/test-2.1-jsps                RUNNING
>> [INFO] web-testsuite/test-2.1-jsps                SUCCESS  
>> (0:00:36.607)
>> [INFO] web-testsuite/test-2.5-servlets            RUNNING
>> [INFO] web-testsuite/test-2.5-servlets            SUCCESS  
>> (0:00:35.783)
>> [INFO] web-testsuite/test-jetty                   RUNNING
>> [INFO] web-testsuite/test-jetty                   SUCCESS  
>> (0:00:28.112)
>> [INFO] web-testsuite/test-myfaces                 RUNNING
>> [INFO] web-testsuite/test-myfaces                 SUCCESS  
>> (0:00:37.326)
>> [INFO] web-testsuite/test-web-forward             RUNNING
>> [INFO] web-testsuite/test-web-forward             SUCCESS  
>> (0:00:42.400)
>> [INFO] web-testsuite/test-web-references          RUNNING
>> [INFO] web-testsuite/test-web-references          SUCCESS  
>> (0:00:47.910)
>> [INFO] webservices-testsuite/jaxb-tests           RUNNING
>> [INFO] webservices-testsuite/jaxb-tests           SUCCESS  
>> (0:01:10.032)
>> [INFO] webservices-testsuite/jaxr-tests           RUNNING
>> [INFO] webservices-testsuite/jaxr-tests           SUCCESS  
>> (0:01:11.393)
>> [INFO] webservices-testsuite/jaxrpc-jaxws-tests   RUNNING
>> [INFO] webservices-testsuite/jaxrpc-jaxws-tests   SUCCESS  
>> (0:00:35.156)
>> [INFO] webservices-testsuite/jaxrpc-tests         RUNNING
>> [INFO] webservices-testsuite/jaxrpc-tests         FAILURE  
>> (0:00:54.749) Java returned: 1
>> [INFO] webservices-testsuite/jaxws-catalog-tests  RUNNING
>> [INFO] webservices-testsuite/jaxws-catalog-tests  FAILURE  
>> (0:00:50.021) Java returned: 1
>> [INFO] webservices-testsuite/jaxws-mtom-tests     RUNNING
>> [INFO] webservices-testsuite/jaxws-mtom-tests     FAILURE  
>> (0:00:36.808) Java returned: 1
>> [INFO] webservices-testsuite/jaxws-provider-tests RUNNING
>> [INFO] webservices-testsuite/jaxws-provider-tests FAILURE  
>> (0:00:39.800) Java returned: 1
>> [INFO] webservices-testsuite/jaxws-tests          RUNNING
>> [INFO] webservices-testsuite/jaxws-tests          FAILURE  
>> (0:01:19.173) Java returned: 1
>> [INFO] webservices-testsuite/jaxws-wsa-tests      RUNNING
>> [INFO] webservices-testsuite/jaxws-wsa-tests      FAILURE  
>> (0:00:37.585) Java returned: 1
>> [INFO] webservices-testsuite/saaj-tests           RUNNING
>> [INFO] webservices-testsuite/saaj-tests           SUCCESS  
>> (0:00:45.491)
>> [INFO] webservices-testsuite/stax-tests           RUNNING
>> [INFO] webservices-testsuite/stax-tests           SUCCESS  
>> (0:01:10.295)
>> [INFO]
>> [INFO]  
>> -------------------------------------------------------------------------------
>> [INFO] Test Summary (0:35:32.216)
>> [INFO]     Passed: 26
>> [INFO]     Failed: 10
>> [INFO]  
>> -------------------------------------------------------------------------------
>> [INFO]
>> [INFO] The following tests failed:
>> [INFO]     * console-testsuite/advanced - /home/geronimo/geronimo/ 
>> 2.2/testsuite/console-testsuite/advanced/build.log
>> [INFO]     * corba-testsuite/corba-helloworld - /home/geronimo/ 
>> geronimo/2.2/testsuite/corba-testsuite/corba-helloworld/build.log
>> [INFO]     * corba-testsuite/corba-marshal - /home/geronimo/ 
>> geronimo/2.2/testsuite/corba-testsuite/corba-marshal/build.log
>> [INFO]     * corba-testsuite/corba-mytime - /home/geronimo/geronimo/ 
>> 2.2/testsuite/corba-testsuite/corba-mytime/build.log
>> [INFO]     * webservices-testsuite/jaxrpc-tests - /home/geronimo/ 
>> geronimo/2.2/testsuite/webservices-testsuite/jaxrpc-tests/build.log
>> [INFO]     * webservices-testsuite/jaxws-catalog-tests - /home/ 
>> geronimo/geronimo/2.2/testsuite/webservices-testsuite/jaxws-catalog- 
>> tests/build.log
>> [INFO]     * webservices-testsuite/jaxws-mtom-tests - /home/ 
>> geronimo/geronimo/2.2/testsuite/webservices-testsuite/jaxws-mtom- 
>> tests/build.log
>> [INFO]     * webservices-testsuite/jaxws-provider-tests - /home/ 
>> geronimo/geronimo/2.2/testsuite/webservices-testsuite/jaxws- 
>> provider-tests/build.log
>> [INFO]     * webservices-testsuite/jaxws-tests - /home/geronimo/ 
>> geronimo/2.2/testsuite/webservices-testsuite/jaxws-tests/build.log
>> [INFO]     * webservices-testsuite/jaxws-wsa-tests - /home/geronimo/ 
>> geronimo/2.2/testsuite/webservices-testsuite/jaxws-wsa-tests/ 
>> build.log
>> [INFO]
>> [INFO]  
>> ------------------------------------------------------------------------
>> [ERROR] BUILD ERROR
>>
>> Samples: branches/2.2
>> =================================
>> Log: http://people.apache.org/builds/geronimo/server/binaries/2.2/20091031/samples-1400.log
>>
>> Build status: OK
>>
>


Mime
View raw message