geronimo-dev mailing list archives

Site index · List index
Message view « Date » · « Thread »
Top « Date » · « Thread »
From ga...@apache.org
Subject [BUILD] branches/2.2: Failed for Revision: 834595
Date Tue, 10 Nov 2009 19:04:02 GMT
Geronimo Revision: 834595 built with tests included
 
See the full build-1400.log file at http://people.apache.org/builds/geronimo/server/binaries/2.2/20091110/build-1400.log
 
 
See the unit test reports at http://people.apache.org/builds/geronimo/server/binaries/2.2/20091110/unit-test-reports
 
12K downloaded
Downloading: http://repo.exist.com/maven2/org/apache/maven/wagon/wagon-http-shared/1.0-beta-2/wagon-http-shared-1.0-beta-2.jar
9K downloaded
Downloading: http://repo.exist.com/maven2/org/apache/maven/reporting/maven-reporting-api/2.0.6/maven-reporting-api-2.0.6.jar
9K downloaded
Downloading: http://repo.exist.com/maven2/org/apache/maven/doxia/doxia-sink-api/1.0-alpha-7/doxia-sink-api-1.0-alpha-7.jar
5K downloaded
Downloading: http://repo.exist.com/maven2/org/apache/maven/maven-error-diagnostics/2.0.6/maven-error-diagnostics-2.0.6.jar
13K downloaded
Downloading: http://repo.exist.com/maven2/org/apache/maven/wagon/wagon-ssh-external/1.0-beta-2/wagon-ssh-external-1.0-beta-2.jar
12K downloaded
Downloading: http://repo.exist.com/maven2/org/apache/maven/wagon/wagon-ssh-common/1.0-beta-2/wagon-ssh-common-1.0-beta-2.jar
24K downloaded
Downloading: http://repo.exist.com/maven2/org/codehaus/plexus/plexus-interactivity-api/1.0-alpha-4/plexus-interactivity-api-1.0-alpha-4.jar
13K downloaded
Downloading: http://repo.exist.com/maven2/classworlds/classworlds/1.1-alpha-2/classworlds-1.1-alpha-2.jar
36K downloaded
Downloading: http://repo.exist.com/maven2/org/apache/maven/maven-plugin-descriptor/2.0.6/maven-plugin-descriptor-2.0.6.jar
36K downloaded
Downloading: http://repo.exist.com/maven2/org/apache/maven/maven-monitor/2.0.6/maven-monitor-2.0.6.jar
10K downloaded
Downloading: http://repo.exist.com/maven2/org/apache/maven/wagon/wagon-ssh/1.0-beta-2/wagon-ssh-1.0-beta-2.jar
23K downloaded
Downloading: http://repo.exist.com/maven2/com/jcraft/jsch/0.1.27/jsch-0.1.27.jar
119K downloaded
Downloading: http://repo.exist.com/maven2/org/codehaus/plexus/plexus-interpolation/1.7/plexus-interpolation-1.7.jar
49K downloaded
[INFO] [enforcer:enforce {execution: default}]
[WARNING] POM for 'com.envoisolutions.sxc:sxc-runtime:pom:0.7.2:compile' is invalid. It will
be ignored for artifact resolution. Reason: Not a v4.0.0 POM. for project com.envoisolutions.sxc:sxc-runtime
at /home/geronimo/.m2/repository/com/envoisolutions/sxc/sxc-runtime/0.7.2/sxc-runtime-0.7.2.pom
[WARNING] POM for 'com.envoisolutions.sxc:sxc-runtime:pom:0.7.2:compile' is invalid. It will
be ignored for artifact resolution. Reason: Not a v4.0.0 POM. for project com.envoisolutions.sxc:sxc-runtime
at /home/geronimo/.m2/repository/com/envoisolutions/sxc/sxc-runtime/0.7.2/sxc-runtime-0.7.2.pom
[INFO] [plugin:descriptor]
[INFO] Using 'UTF-8' encoding to read mojo metadata.
[INFO] Applying mojo extractor for language: java
[WARNING] org.apache.geronimo.mavenplugins.car.ArchiveCarMojo#jarArchiver:
[WARNING]   The syntax
[WARNING]     @parameter expression="${component.<role>#<roleHint>}"
[WARNING]   is deprecated, please use
[WARNING]     @component role="<role>" roleHint="<roleHint>"
[WARNING]   instead.
[INFO] Mojo extractor for language: java found 10 mojo descriptors.
[INFO] Applying mojo extractor for language: bsh
[INFO] Mojo extractor for language: bsh found 0 mojo descriptors.
[WARNING] POM for 'com.envoisolutions.sxc:sxc-runtime:pom:0.7.2:compile' is invalid. It will
be ignored for artifact resolution. Reason: Not a v4.0.0 POM. for project com.envoisolutions.sxc:sxc-runtime
at /home/geronimo/.m2/repository/com/envoisolutions/sxc/sxc-runtime/0.7.2/sxc-runtime-0.7.2.pom
[WARNING] POM for 'com.envoisolutions.sxc:sxc-runtime:pom:0.7.2:compile' is invalid. It will
be ignored for artifact resolution. Reason: Not a v4.0.0 POM. for project com.envoisolutions.sxc:sxc-runtime
at /home/geronimo/.m2/repository/com/envoisolutions/sxc/sxc-runtime/0.7.2/sxc-runtime-0.7.2.pom
[INFO] [remote-resources:process {execution: default}]
[WARNING] Attempting to build MavenProject instance for Artifact (com.envoisolutions.sxc:sxc-runtime:0.7.2)
of type: jar; constructing POM artifact instead.
[WARNING] Invalid project model for artifact [sxc-runtime:com.envoisolutions.sxc:0.7.2]. It
will be ignored by the remote resources Mojo.
[INFO] [resources:resources]
[INFO] Using 'UTF-8' encoding to copy filtered resources.
[INFO] Copying 1 resource
[INFO] skip non existing resourceDirectory /home/geronimo/geronimo/2.2/framework/buildsupport/car-maven-plugin/src/main/filtered-resources
[INFO] Copying 3 resources
[WARNING] POM for 'com.envoisolutions.sxc:sxc-runtime:pom:0.7.2:compile' is invalid. It will
be ignored for artifact resolution. Reason: Not a v4.0.0 POM. for project com.envoisolutions.sxc:sxc-runtime
at /home/geronimo/.m2/repository/com/envoisolutions/sxc/sxc-runtime/0.7.2/sxc-runtime-0.7.2.pom
[WARNING] POM for 'com.envoisolutions.sxc:sxc-runtime:pom:0.7.2:compile' is invalid. It will
be ignored for artifact resolution. Reason: Not a v4.0.0 POM. for project com.envoisolutions.sxc:sxc-runtime
at /home/geronimo/.m2/repository/com/envoisolutions/sxc/sxc-runtime/0.7.2/sxc-runtime-0.7.2.pom
[INFO] [compiler:compile]
[INFO] Compiling 20 source files to /home/geronimo/geronimo/2.2/framework/buildsupport/car-maven-plugin/target/classes
[INFO] ------------------------------------------------------------------------
[ERROR] BUILD FAILURE
[INFO] ------------------------------------------------------------------------
[INFO] Compilation failure
error: error reading /home/geronimo/.m2/repository/com/envoisolutions/sxc/sxc-runtime/0.7.2/sxc-runtime-0.7.2.jar;
error in opening zip file


error: error reading /home/geronimo/.m2/repository/com/envoisolutions/sxc/sxc-runtime/0.7.2/sxc-runtime-0.7.2.jar;
error in opening zip file

[INFO] ------------------------------------------------------------------------
[INFO] Trace
org.apache.maven.BuildFailureException: Compilation failure
error: error reading /home/geronimo/.m2/repository/com/envoisolutions/sxc/sxc-runtime/0.7.2/sxc-runtime-0.7.2.jar;
error in opening zip file

	at org.apache.maven.lifecycle.DefaultLifecycleExecutor.executeGoals(DefaultLifecycleExecutor.java:580)
	at org.apache.maven.lifecycle.DefaultLifecycleExecutor.executeGoalWithLifecycle(DefaultLifecycleExecutor.java:500)
	at org.apache.maven.lifecycle.DefaultLifecycleExecutor.executeGoal(DefaultLifecycleExecutor.java:479)
	at org.apache.maven.lifecycle.DefaultLifecycleExecutor.executeGoalAndHandleFailures(DefaultLifecycleExecutor.java:331)
	at org.apache.maven.lifecycle.DefaultLifecycleExecutor.executeTaskSegments(DefaultLifecycleExecutor.java:292)
	at org.apache.maven.lifecycle.DefaultLifecycleExecutor.execute(DefaultLifecycleExecutor.java:142)
	at org.apache.maven.DefaultMaven.doExecute(DefaultMaven.java:336)
	at org.apache.maven.DefaultMaven.execute(DefaultMaven.java:129)
	at org.apache.maven.cli.MavenCli.main(MavenCli.java:301)
	at sun.reflect.NativeMethodAccessorImpl.invoke0(Native Method)
	at sun.reflect.NativeMethodAccessorImpl.invoke(NativeMethodAccessorImpl.java:39)
	at sun.reflect.DelegatingMethodAccessorImpl.invoke(DelegatingMethodAccessorImpl.java:25)
	at java.lang.reflect.Method.invoke(Method.java:585)
	at org.codehaus.classworlds.Launcher.launchEnhanced(Launcher.java:315)
	at org.codehaus.classworlds.Launcher.launch(Launcher.java:255)
	at org.codehaus.classworlds.Launcher.mainWithExitCode(Launcher.java:430)
	at org.codehaus.classworlds.Launcher.main(Launcher.java:375)
Caused by: org.apache.maven.plugin.CompilationFailureException: Compilation failure
error: error reading /home/geronimo/.m2/repository/com/envoisolutions/sxc/sxc-runtime/0.7.2/sxc-runtime-0.7.2.jar;
error in opening zip file

	at org.apache.maven.plugin.AbstractCompilerMojo.execute(AbstractCompilerMojo.java:516)
	at org.apache.maven.plugin.CompilerMojo.execute(CompilerMojo.java:114)
	at org.apache.maven.plugin.DefaultPluginManager.executeMojo(DefaultPluginManager.java:453)
	at org.apache.maven.lifecycle.DefaultLifecycleExecutor.executeGoals(DefaultLifecycleExecutor.java:559)
	... 16 more
[INFO] ------------------------------------------------------------------------
[INFO] Total time: 9 minutes 13 seconds
[INFO] Finished at: Tue Nov 10 14:12:06 EST 2009
[INFO] Final Memory: 196M/536M
[INFO] ------------------------------------------------------------------------

Mime
View raw message