geronimo-dev mailing list archives

Site index · List index
Message view « Date » · « Thread »
Top « Date » · « Thread »
From ga...@apache.org
Subject [BUILD] branches/2.1: Failed for Revision: 833636
Date Sat, 07 Nov 2009 07:24:36 GMT
Geronimo Revision: 833636 built with tests included
 
See the full build-0200.log file at http://people.apache.org/builds/geronimo/server/binaries/2.1/20091107/build-0200.log
 
 
See the unit test reports at http://people.apache.org/builds/geronimo/server/binaries/2.1/20091107/unit-test-reports
 
[INFO] Installing /home/geronimo/geronimo/2.1/plugins/corba/geronimo-corba-builder/target/geronimo-corba-builder-2.1.5-SNAPSHOT.jar
to /home/geronimo/.m2/repository/org/apache/geronimo/modules/geronimo-corba-builder/2.1.5-SNAPSHOT/geronimo-corba-builder-2.1.5-SNAPSHOT.jar
[INFO] ------------------------------------------------------------------------
[INFO] Building Geronimo Plugins, Corba :: Yoko
[INFO]    task-segment: [install]
[INFO] ------------------------------------------------------------------------
Downloading: http://people.apache.org/repo/m2-incubating-repository//org/apache/yoko/yoko-core/1.0/yoko-core-1.0.pom
Downloading: http://repo.exist.com/maven2/org/apache/yoko/yoko-core/1.0/yoko-core-1.0.pom
5K downloaded
Downloading: http://people.apache.org/repo/m2-incubating-repository//org/apache/yoko/yoko-rmi-spec/1.0/yoko-rmi-spec-1.0.pom
Downloading: http://repo.exist.com/maven2/org/apache/yoko/yoko-rmi-spec/1.0/yoko-rmi-spec-1.0.pom
2K downloaded
Downloading: http://people.apache.org/repo/m2-incubating-repository//org/apache/yoko/yoko-rmi-impl/1.0/yoko-rmi-impl-1.0.pom
Downloading: http://repo.exist.com/maven2/org/apache/yoko/yoko-rmi-impl/1.0/yoko-rmi-impl-1.0.pom
2K downloaded
Downloading: http://people.apache.org/repo/m2-incubating-repository//org/apache/bcel/bcel/5.2/bcel-5.2.pom
Downloading: http://repo.exist.com/maven2/org/apache/bcel/bcel/5.2/bcel-5.2.pom
619b downloaded
Downloading: http://people.apache.org/repo/m2-incubating-repository//jakarta-regexp/jakarta-regexp/1.4/jakarta-regexp-1.4.pom
Downloading: http://repo.exist.com/maven2/jakarta-regexp/jakarta-regexp/1.4/jakarta-regexp-1.4.pom
160b downloaded
Downloading: http://people.apache.org/repo/m2-incubating-repository//org/apache/yoko/yoko-core/1.0/yoko-core-1.0.jar
Downloading: http://repo.exist.com/maven2/org/apache/yoko/yoko-core/1.0/yoko-core-1.0.jar
1084K downloaded
Downloading: http://people.apache.org/repo/m2-incubating-repository//org/apache/yoko/yoko-rmi-spec/1.0/yoko-rmi-spec-1.0.jar
Downloading: https://maven-repository.dev.java.net/nonav/repository//org.apache.yoko/jars/yoko-rmi-spec-1.0.jar
363b downloaded
[WARNING] *** CHECKSUM FAILED - Checksum failed on download: local = '5e93690c8af7bea8a24937c5d5189a4ea6234ec6';
remote = '<!DOCTYPE' - RETRYING
Downloading: https://maven-repository.dev.java.net/nonav/repository//org.apache.yoko/jars/yoko-rmi-spec-1.0.jar
363b downloaded
[WARNING] *** CHECKSUM FAILED - Checksum failed on download: local = '5e93690c8af7bea8a24937c5d5189a4ea6234ec6';
remote = '<!DOCTYPE' - IGNORING
Downloading: http://people.apache.org/repo/m2-incubating-repository//org/apache/yoko/yoko-rmi-impl/1.0/yoko-rmi-impl-1.0.jar
Downloading: http://repo.exist.com/maven2/org/apache/yoko/yoko-rmi-impl/1.0/yoko-rmi-impl-1.0.jar
277K downloaded
Downloading: http://people.apache.org/repo/m2-incubating-repository//org/apache/bcel/bcel/5.2/bcel-5.2.jar
Downloading: https://maven-repository.dev.java.net/nonav/repository//org.apache.bcel/jars/bcel-5.2.jar
354b downloaded
[WARNING] *** CHECKSUM FAILED - Checksum failed on download: local = '85074994d41c016b7762e62cee26556efc0694e9';
remote = '<!DOCTYPE' - RETRYING
Downloading: https://maven-repository.dev.java.net/nonav/repository//org.apache.bcel/jars/bcel-5.2.jar
354b downloaded
[WARNING] *** CHECKSUM FAILED - Checksum failed on download: local = '85074994d41c016b7762e62cee26556efc0694e9';
remote = '<!DOCTYPE' - IGNORING
Downloading: http://people.apache.org/repo/m2-incubating-repository//jakarta-regexp/jakarta-regexp/1.4/jakarta-regexp-1.4.jar
Downloading: http://repo.exist.com/maven2/jakarta-regexp/jakarta-regexp/1.4/jakarta-regexp-1.4.jar
27K downloaded
[INFO] [enforcer:enforce {execution: default}]
[INFO] [dependency:copy {execution: default}]
[INFO] Configured Artifact: org.apache.yoko:yoko-spec-corba:?:jar
[INFO] Configured Artifact: org.apache.yoko:yoko-core:?:jar
[INFO] Copying yoko-spec-corba-1.0.jar to /home/geronimo/geronimo/2.1/plugins/corba/geronimo-yoko/target/endorsed/yoko-spec-corba-1.0.jar
[INFO] Copying yoko-core-1.0.jar to /home/geronimo/geronimo/2.1/plugins/corba/geronimo-yoko/target/endorsed/yoko-core-1.0.jar
[INFO] [tools:copy-legal-files {execution: install-legal-files}]
[INFO] Created dir: /home/geronimo/geronimo/2.1/plugins/corba/geronimo-yoko/target/classes/META-INF
[INFO] Copying 2 files to /home/geronimo/geronimo/2.1/plugins/corba/geronimo-yoko/target/classes/META-INF
[INFO] [resources:resources]
[INFO] Using default encoding to copy filtered resources.
[INFO] [compiler:compile]
[INFO] Compiling 7 source files to /home/geronimo/geronimo/2.1/plugins/corba/geronimo-yoko/target/classes
[INFO] ------------------------------------------------------------------------
[ERROR] BUILD FAILURE
[INFO] ------------------------------------------------------------------------
[INFO] Compilation failure
error: error reading /home/geronimo/.m2/repository/org/apache/yoko/yoko-rmi-spec/1.0/yoko-rmi-spec-1.0.jar;
error in opening zip file


error: error reading /home/geronimo/.m2/repository/org/apache/yoko/yoko-rmi-spec/1.0/yoko-rmi-spec-1.0.jar;
error in opening zip file

[INFO] ------------------------------------------------------------------------
[INFO] Trace
org.apache.maven.BuildFailureException: Compilation failure
error: error reading /home/geronimo/.m2/repository/org/apache/yoko/yoko-rmi-spec/1.0/yoko-rmi-spec-1.0.jar;
error in opening zip file

	at org.apache.maven.lifecycle.DefaultLifecycleExecutor.executeGoals(DefaultLifecycleExecutor.java:579)
	at org.apache.maven.lifecycle.DefaultLifecycleExecutor.executeGoalWithLifecycle(DefaultLifecycleExecutor.java:499)
	at org.apache.maven.lifecycle.DefaultLifecycleExecutor.executeGoal(DefaultLifecycleExecutor.java:478)
	at org.apache.maven.lifecycle.DefaultLifecycleExecutor.executeGoalAndHandleFailures(DefaultLifecycleExecutor.java:330)
	at org.apache.maven.lifecycle.DefaultLifecycleExecutor.executeTaskSegments(DefaultLifecycleExecutor.java:291)
	at org.apache.maven.lifecycle.DefaultLifecycleExecutor.execute(DefaultLifecycleExecutor.java:142)
	at org.apache.maven.DefaultMaven.doExecute(DefaultMaven.java:336)
	at org.apache.maven.DefaultMaven.execute(DefaultMaven.java:129)
	at org.apache.maven.cli.MavenCli.main(MavenCli.java:287)
	at sun.reflect.NativeMethodAccessorImpl.invoke0(Native Method)
	at sun.reflect.NativeMethodAccessorImpl.invoke(NativeMethodAccessorImpl.java:39)
	at sun.reflect.DelegatingMethodAccessorImpl.invoke(DelegatingMethodAccessorImpl.java:25)
	at java.lang.reflect.Method.invoke(Method.java:585)
	at org.codehaus.classworlds.Launcher.launchEnhanced(Launcher.java:315)
	at org.codehaus.classworlds.Launcher.launch(Launcher.java:255)
	at org.codehaus.classworlds.Launcher.mainWithExitCode(Launcher.java:430)
	at org.codehaus.classworlds.Launcher.main(Launcher.java:375)
Caused by: org.apache.maven.plugin.CompilationFailureException: Compilation failure
error: error reading /home/geronimo/.m2/repository/org/apache/yoko/yoko-rmi-spec/1.0/yoko-rmi-spec-1.0.jar;
error in opening zip file

	at org.apache.maven.plugin.AbstractCompilerMojo.execute(AbstractCompilerMojo.java:516)
	at org.apache.maven.plugin.CompilerMojo.execute(CompilerMojo.java:114)
	at org.apache.maven.plugin.DefaultPluginManager.executeMojo(DefaultPluginManager.java:451)
	at org.apache.maven.lifecycle.DefaultLifecycleExecutor.executeGoals(DefaultLifecycleExecutor.java:558)
	... 16 more
[INFO] ------------------------------------------------------------------------
[INFO] Total time: 27 minutes 8 seconds
[INFO] Finished at: Sat Nov 07 02:31:07 EST 2009
[INFO] Final Memory: 276M/561M
[INFO] ------------------------------------------------------------------------

Mime
View raw message