geronimo-dev mailing list archives

Site index · List index
Message view « Date » · « Thread »
Top « Date » · « Thread »
From ga...@apache.org
Subject [BUILD] branches/2.2: Failed for Revision: 831620
Date Sun, 01 Nov 2009 02:16:55 GMT
Geronimo Revision: 831620 built with tests included
 
See the full build-2000.log file at http://people.apache.org/builds/geronimo/server/binaries/2.2/20091031/build-2000.log
 
Download the binaries from http://people.apache.org/builds/geronimo/server/binaries/2.2/20091031
[INFO] BUILD SUCCESSFUL
[INFO] ------------------------------------------------------------------------
[INFO] Total time: 37 minutes 42 seconds
[INFO] Finished at: Sat Oct 31 20:42:30 EDT 2009
[INFO] Final Memory: 321M/897M
[INFO] ------------------------------------------------------------------------
 
TESTSUITE RESULTS (Failures only)
=================================
 
Assembly: tomcat
=================================
See full test results and logs at http://people.apache.org/builds/geronimo/server/binaries/2.2/20091031/logs-2000-tomcat/
 
 
[INFO] Waiting for Geronimo server...
[INFO] Geronimo server started in 0:00:51.648
[INFO] [shitty:install {execution: default}]
[INFO] Installing /home/geronimo/geronimo/2.2/testsuite/pom.xml to /home/geronimo/.m2/repository/org/apache/geronimo/testsuite/testsuite/testing/testsuite-testing.pom
[INFO] [shitty:test {execution: default}]
[INFO] Starting 36 test builds
[INFO] 
[INFO] -------------------------------------------------------------------------------
[INFO] 
[INFO] commands-testsuite/deploy                  RUNNING
[INFO] commands-testsuite/deploy                  SUCCESS (0:01:24.276) 
[INFO] commands-testsuite/gshell                  RUNNING
[INFO] commands-testsuite/gshell                  SUCCESS (0:00:38.732) 
[INFO] commands-testsuite/jaxws                   RUNNING
[INFO] commands-testsuite/jaxws                   SUCCESS (0:00:46.142) 
[INFO] commands-testsuite/shutdown                RUNNING
[INFO] commands-testsuite/shutdown                SUCCESS (0:00:23.797) 
[INFO] concurrent-testsuite/concurrent-basic      RUNNING
[INFO] concurrent-testsuite/concurrent-basic      SUCCESS (0:06:36.517) 
[INFO] console-testsuite/advanced                 RUNNING
[INFO] console-testsuite/advanced                 SUCCESS (0:01:39.112) 
[INFO] console-testsuite/basic                    RUNNING
[INFO] console-testsuite/basic                    SUCCESS (0:02:02.613) 
[INFO] corba-testsuite/corba-helloworld           RUNNING
[INFO] corba-testsuite/corba-helloworld           FAILURE (0:00:50.705) Java returned: 1
[INFO] corba-testsuite/corba-marshal              RUNNING
[INFO] corba-testsuite/corba-marshal              FAILURE (0:00:42.482) Java returned: 1
[INFO] corba-testsuite/corba-mytime               RUNNING
[INFO] corba-testsuite/corba-mytime               FAILURE (0:00:43.548) Java returned: 1
[INFO] deployment-testsuite/deployment-tests      RUNNING
[INFO] deployment-testsuite/deployment-tests      SUCCESS (0:00:39.261) 
[INFO] deployment-testsuite/jca-cms-tests         RUNNING
[INFO] deployment-testsuite/jca-cms-tests         SUCCESS (0:00:36.260) 
[INFO] deployment-testsuite/manifestcp-tests      RUNNING
[INFO] deployment-testsuite/manifestcp-tests      SUCCESS (0:00:40.777) 
[INFO] enterprise-testsuite/ejb-tests             RUNNING
[INFO] enterprise-testsuite/ejb-tests             SUCCESS (0:01:10.196) 
[INFO] enterprise-testsuite/jms-tests             RUNNING
[INFO] enterprise-testsuite/jms-tests             SUCCESS (0:01:22.338) 
[INFO] enterprise-testsuite/jpa-tests             RUNNING
[INFO] enterprise-testsuite/jpa-tests             SUCCESS (0:00:59.494) 
[INFO] enterprise-testsuite/sec-client-tests      RUNNING
[INFO] enterprise-testsuite/sec-client-tests      SUCCESS (0:00:34.786) 
[INFO] enterprise-testsuite/sec-tests             RUNNING
[INFO] enterprise-testsuite/sec-tests             SUCCESS (0:01:01.495) 
[INFO] security-testsuite/test-security           RUNNING
[INFO] security-testsuite/test-security           SUCCESS (0:00:58.146) 
[INFO] web-testsuite/test-2.1-jsps                RUNNING
[INFO] web-testsuite/test-2.1-jsps                SUCCESS (0:00:37.386) 
[INFO] web-testsuite/test-2.5-servlets            RUNNING
[INFO] web-testsuite/test-2.5-servlets            SUCCESS (0:00:36.075) 
[INFO] web-testsuite/test-myfaces                 RUNNING
[INFO] web-testsuite/test-myfaces                 SUCCESS (0:00:37.976) 
[INFO] web-testsuite/test-tomcat                  RUNNING
[INFO] web-testsuite/test-tomcat                  SUCCESS (0:00:28.200) 
[INFO] web-testsuite/test-web-forward             RUNNING
[INFO] web-testsuite/test-web-forward             SUCCESS (0:00:43.529) 
[INFO] web-testsuite/test-web-references          RUNNING
[INFO] web-testsuite/test-web-references          SUCCESS (0:00:49.977) 
[INFO] webservices-testsuite/jaxb-tests           RUNNING
[INFO] webservices-testsuite/jaxb-tests           SUCCESS (0:01:10.167) 
[INFO] webservices-testsuite/jaxr-tests           RUNNING
[INFO] webservices-testsuite/jaxr-tests           SUCCESS (0:01:10.082) 
[INFO] webservices-testsuite/jaxrpc-jaxws-tests   RUNNING
[INFO] webservices-testsuite/jaxrpc-jaxws-tests   SUCCESS (0:00:41.965) 
[INFO] webservices-testsuite/jaxrpc-tests         RUNNING
[INFO] webservices-testsuite/jaxrpc-tests         FAILURE (0:00:55.332) Java returned: 1
[INFO] webservices-testsuite/jaxws-catalog-tests  RUNNING
[INFO] webservices-testsuite/jaxws-catalog-tests  FAILURE (0:00:49.956) Java returned: 1
[INFO] webservices-testsuite/jaxws-mtom-tests     RUNNING
[INFO] webservices-testsuite/jaxws-mtom-tests     FAILURE (0:00:45.967) Java returned: 1
[INFO] webservices-testsuite/jaxws-provider-tests RUNNING
[INFO] webservices-testsuite/jaxws-provider-tests FAILURE (0:00:42.516) Java returned: 1
[INFO] webservices-testsuite/jaxws-tests          RUNNING
[INFO] webservices-testsuite/jaxws-tests          FAILURE (0:01:29.129) Java returned: 1
[INFO] webservices-testsuite/jaxws-wsa-tests      RUNNING
[INFO] webservices-testsuite/jaxws-wsa-tests      FAILURE (0:00:46.864) Java returned: 1
[INFO] webservices-testsuite/saaj-tests           RUNNING
[INFO] webservices-testsuite/saaj-tests           SUCCESS (0:00:45.945) 
[INFO] webservices-testsuite/stax-tests           RUNNING
[INFO] webservices-testsuite/stax-tests           SUCCESS (0:01:11.452) 
[INFO] 
[INFO] -------------------------------------------------------------------------------
[INFO] Test Summary (0:38:13.425)
[INFO]     Passed: 27
[INFO]     Failed: 9
[INFO] -------------------------------------------------------------------------------
[INFO] 
[INFO] The following tests failed:
[INFO]     * corba-testsuite/corba-helloworld - /home/geronimo/geronimo/2.2/testsuite/corba-testsuite/corba-helloworld/build.log
[INFO]     * corba-testsuite/corba-marshal - /home/geronimo/geronimo/2.2/testsuite/corba-testsuite/corba-marshal/build.log
[INFO]     * corba-testsuite/corba-mytime - /home/geronimo/geronimo/2.2/testsuite/corba-testsuite/corba-mytime/build.log
[INFO]     * webservices-testsuite/jaxrpc-tests - /home/geronimo/geronimo/2.2/testsuite/webservices-testsuite/jaxrpc-tests/build.log
[INFO]     * webservices-testsuite/jaxws-catalog-tests - /home/geronimo/geronimo/2.2/testsuite/webservices-testsuite/jaxws-catalog-tests/build.log
[INFO]     * webservices-testsuite/jaxws-mtom-tests - /home/geronimo/geronimo/2.2/testsuite/webservices-testsuite/jaxws-mtom-tests/build.log
[INFO]     * webservices-testsuite/jaxws-provider-tests - /home/geronimo/geronimo/2.2/testsuite/webservices-testsuite/jaxws-provider-tests/build.log
[INFO]     * webservices-testsuite/jaxws-tests - /home/geronimo/geronimo/2.2/testsuite/webservices-testsuite/jaxws-tests/build.log
[INFO]     * webservices-testsuite/jaxws-wsa-tests - /home/geronimo/geronimo/2.2/testsuite/webservices-testsuite/jaxws-wsa-tests/build.log
[INFO] 
[INFO] ------------------------------------------------------------------------
[ERROR] BUILD ERROR
 
Assembly: jetty
=================================
See full test results and logs at http://people.apache.org/builds/geronimo/server/binaries/2.2/20091031/logs-2000-jetty/
 
 
[INFO] Waiting for Geronimo server...
[INFO] Geronimo server started in 0:00:52.098
[INFO] [shitty:install {execution: default}]
[INFO] Installing /home/geronimo/geronimo/2.2/testsuite/pom.xml to /home/geronimo/.m2/repository/org/apache/geronimo/testsuite/testsuite/testing/testsuite-testing.pom
[INFO] [shitty:test {execution: default}]
[INFO] Starting 36 test builds
[INFO] 
[INFO] -------------------------------------------------------------------------------
[INFO] 
[INFO] commands-testsuite/deploy                  RUNNING
[INFO] commands-testsuite/deploy                  SUCCESS (0:01:21.674) 
[INFO] commands-testsuite/gshell                  RUNNING
[INFO] commands-testsuite/gshell                  SUCCESS (0:00:40.417) 
[INFO] commands-testsuite/jaxws                   RUNNING
[INFO] commands-testsuite/jaxws                   SUCCESS (0:00:46.953) 
[INFO] commands-testsuite/shutdown                RUNNING
[INFO] commands-testsuite/shutdown                SUCCESS (0:00:23.588) 
[INFO] concurrent-testsuite/concurrent-basic      RUNNING
[INFO] concurrent-testsuite/concurrent-basic      SUCCESS (0:06:29.980) 
[INFO] console-testsuite/advanced                 RUNNING
[INFO] console-testsuite/advanced                 SUCCESS (0:01:34.195) 
[INFO] console-testsuite/basic                    RUNNING
[INFO] console-testsuite/basic                    SUCCESS (0:02:04.282) 
[INFO] corba-testsuite/corba-helloworld           RUNNING
[INFO] corba-testsuite/corba-helloworld           FAILURE (0:00:50.172) Java returned: 1
[INFO] corba-testsuite/corba-marshal              RUNNING
[INFO] corba-testsuite/corba-marshal              FAILURE (0:00:43.454) Java returned: 1
[INFO] corba-testsuite/corba-mytime               RUNNING
[INFO] corba-testsuite/corba-mytime               FAILURE (0:00:42.410) Java returned: 1
[INFO] deployment-testsuite/deployment-tests      RUNNING
[INFO] deployment-testsuite/deployment-tests      SUCCESS (0:00:38.372) 
[INFO] deployment-testsuite/jca-cms-tests         RUNNING
[INFO] deployment-testsuite/jca-cms-tests         SUCCESS (0:00:34.276) 
[INFO] deployment-testsuite/manifestcp-tests      RUNNING
[INFO] deployment-testsuite/manifestcp-tests      SUCCESS (0:00:40.488) 
[INFO] enterprise-testsuite/ejb-tests             RUNNING
[INFO] enterprise-testsuite/ejb-tests             SUCCESS (0:00:55.691) 
[INFO] enterprise-testsuite/jms-tests             RUNNING
[INFO] enterprise-testsuite/jms-tests             SUCCESS (0:01:20.655) 
[INFO] enterprise-testsuite/jpa-tests             RUNNING
[INFO] enterprise-testsuite/jpa-tests             SUCCESS (0:00:50.047) 
[INFO] enterprise-testsuite/sec-client-tests      RUNNING
[INFO] enterprise-testsuite/sec-client-tests      SUCCESS (0:00:34.988) 
[INFO] enterprise-testsuite/sec-tests             RUNNING
[INFO] enterprise-testsuite/sec-tests             SUCCESS (0:01:01.402) 
[INFO] security-testsuite/test-security           RUNNING
[INFO] security-testsuite/test-security           SUCCESS (0:00:58.685) 
[INFO] web-testsuite/test-2.1-jsps                RUNNING
[INFO] web-testsuite/test-2.1-jsps                SUCCESS (0:00:37.516) 
[INFO] web-testsuite/test-2.5-servlets            RUNNING
[INFO] web-testsuite/test-2.5-servlets            SUCCESS (0:00:35.316) 
[INFO] web-testsuite/test-jetty                   RUNNING
[INFO] web-testsuite/test-jetty                   SUCCESS (0:00:28.633) 
[INFO] web-testsuite/test-myfaces                 RUNNING
[INFO] web-testsuite/test-myfaces                 SUCCESS (0:00:39.584) 
[INFO] web-testsuite/test-web-forward             RUNNING
[INFO] web-testsuite/test-web-forward             SUCCESS (0:00:42.881) 
[INFO] web-testsuite/test-web-references          RUNNING
[INFO] web-testsuite/test-web-references          SUCCESS (0:00:47.401) 
[INFO] webservices-testsuite/jaxb-tests           RUNNING
[INFO] webservices-testsuite/jaxb-tests           SUCCESS (0:01:10.656) 
[INFO] webservices-testsuite/jaxr-tests           RUNNING
[INFO] webservices-testsuite/jaxr-tests           SUCCESS (0:01:09.744) 
[INFO] webservices-testsuite/jaxrpc-jaxws-tests   RUNNING
[INFO] webservices-testsuite/jaxrpc-jaxws-tests   SUCCESS (0:00:35.228) 
[INFO] webservices-testsuite/jaxrpc-tests         RUNNING
[INFO] webservices-testsuite/jaxrpc-tests         FAILURE (0:00:54.470) Java returned: 1
[INFO] webservices-testsuite/jaxws-catalog-tests  RUNNING
[INFO] webservices-testsuite/jaxws-catalog-tests  FAILURE (0:00:50.142) Java returned: 1
[INFO] webservices-testsuite/jaxws-mtom-tests     RUNNING
[INFO] webservices-testsuite/jaxws-mtom-tests     FAILURE (0:00:37.065) Java returned: 1
[INFO] webservices-testsuite/jaxws-provider-tests RUNNING
[INFO] webservices-testsuite/jaxws-provider-tests FAILURE (0:00:41.183) Java returned: 1
[INFO] webservices-testsuite/jaxws-tests          RUNNING
[INFO] webservices-testsuite/jaxws-tests          FAILURE (0:01:20.643) Java returned: 1
[INFO] webservices-testsuite/jaxws-wsa-tests      RUNNING
[INFO] webservices-testsuite/jaxws-wsa-tests      FAILURE (0:00:38.233) Java returned: 1
[INFO] webservices-testsuite/saaj-tests           RUNNING
[INFO] webservices-testsuite/saaj-tests           SUCCESS (0:00:48.182) 
[INFO] webservices-testsuite/stax-tests           RUNNING
[INFO] webservices-testsuite/stax-tests           SUCCESS (0:01:12.595) 
[INFO] 
[INFO] -------------------------------------------------------------------------------
[INFO] Test Summary (0:37:01.434)
[INFO]     Passed: 27
[INFO]     Failed: 9
[INFO] -------------------------------------------------------------------------------
[INFO] 
[INFO] The following tests failed:
[INFO]     * corba-testsuite/corba-helloworld - /home/geronimo/geronimo/2.2/testsuite/corba-testsuite/corba-helloworld/build.log
[INFO]     * corba-testsuite/corba-marshal - /home/geronimo/geronimo/2.2/testsuite/corba-testsuite/corba-marshal/build.log
[INFO]     * corba-testsuite/corba-mytime - /home/geronimo/geronimo/2.2/testsuite/corba-testsuite/corba-mytime/build.log
[INFO]     * webservices-testsuite/jaxrpc-tests - /home/geronimo/geronimo/2.2/testsuite/webservices-testsuite/jaxrpc-tests/build.log
[INFO]     * webservices-testsuite/jaxws-catalog-tests - /home/geronimo/geronimo/2.2/testsuite/webservices-testsuite/jaxws-catalog-tests/build.log
[INFO]     * webservices-testsuite/jaxws-mtom-tests - /home/geronimo/geronimo/2.2/testsuite/webservices-testsuite/jaxws-mtom-tests/build.log
[INFO]     * webservices-testsuite/jaxws-provider-tests - /home/geronimo/geronimo/2.2/testsuite/webservices-testsuite/jaxws-provider-tests/build.log
[INFO]     * webservices-testsuite/jaxws-tests - /home/geronimo/geronimo/2.2/testsuite/webservices-testsuite/jaxws-tests/build.log
[INFO]     * webservices-testsuite/jaxws-wsa-tests - /home/geronimo/geronimo/2.2/testsuite/webservices-testsuite/jaxws-wsa-tests/build.log
[INFO] 
[INFO] ------------------------------------------------------------------------
[ERROR] BUILD ERROR
 
Samples: branches/2.2
=================================
Log: http://people.apache.org/builds/geronimo/server/binaries/2.2/20091031/samples-2000.log
 
Build status: OK
 

Mime
View raw message