geronimo-dev mailing list archives

Site index · List index
Message view « Date » · « Thread »
Top « Date » · « Thread »
From ga...@apache.org
Subject [BUILD] branches/2.2: Failed for Revision: 830406
Date Wed, 28 Oct 2009 00:18:04 GMT
Geronimo Revision: 830406 built with tests included
 
See the full build-2000.log file at http://people.apache.org/builds/geronimo/server/binaries/2.2/20091027/build-2000.log
 
 
See the unit test reports at http://people.apache.org/builds/geronimo/server/binaries/2.2/20091027/unit-test-reports
 
Downloading: http://svn.apache.org/repos/asf/openejb/repo//org/apache/xbean/xbean-asm-shaded/3.6/xbean-asm-shaded-3.6.jar
Downloading: http://download.java.net/maven/1/org.apache.xbean/jars/xbean-asm-shaded-3.6.jar
Downloading: http://repo.exist.com/maven2/org/apache/xbean/xbean-asm-shaded/3.6/xbean-asm-shaded-3.6.jar
118K downloaded
[WARNING] *** CHECKSUM FAILED - Checksum failed on download: local = '0a394260d8d16ba233796bc68b5f4188442e37fe';
remote = '3e5ce3998772b6a8ccd401ee1caf33fd8949c8d2' - RETRYING
Downloading: http://repo.exist.com/maven2/org/apache/xbean/xbean-asm-shaded/3.6/xbean-asm-shaded-3.6.jar
118K downloaded
[WARNING] *** CHECKSUM FAILED - Checksum failed on download: local = '0a394260d8d16ba233796bc68b5f4188442e37fe';
remote = '3e5ce3998772b6a8ccd401ee1caf33fd8949c8d2' - IGNORING
Downloading: http://people.apache.org/repo/m2-incubating-repository/org/codehaus/swizzle/swizzle-stream/1.0.1/swizzle-stream-1.0.1.jar
Downloading: http://tomcat.apache.org/dev/dist/m2-repository/org/codehaus/swizzle/swizzle-stream/1.0.1/swizzle-stream-1.0.1.jar
Downloading: http://svn.apache.org/repos/asf/openejb/repo//org/codehaus/swizzle/swizzle-stream/1.0.1/swizzle-stream-1.0.1.jar
Downloading: http://download.java.net/maven/1/org.codehaus.swizzle/jars/swizzle-stream-1.0.1.jar
Downloading: http://repo.exist.com/maven2/org/codehaus/swizzle/swizzle-stream/1.0.1/swizzle-stream-1.0.1.jar
42K downloaded
Downloading: http://people.apache.org/repo/m2-incubating-repository/quartz/quartz/1.5.2/quartz-1.5.2.jar
Downloading: http://tomcat.apache.org/dev/dist/m2-repository/quartz/quartz/1.5.2/quartz-1.5.2.jar
Downloading: http://svn.apache.org/repos/asf/openejb/repo//quartz/quartz/1.5.2/quartz-1.5.2.jar
Downloading: http://download.java.net/maven/1/quartz/jars/quartz-1.5.2.jar
Downloading: http://repo.exist.com/maven2/quartz/quartz/1.5.2/quartz-1.5.2.jar
379K downloaded
Downloading: http://repo.exist.com/maven2/org/apache/openejb/openejb-ejbd/3.1.2/openejb-ejbd-3.1.2.jar
54K downloaded
Downloading: http://repo.exist.com/maven2/org/apache/openejb/openejb-server/3.1.2/openejb-server-3.1.2.jar
73K downloaded
Downloading: http://repo.exist.com/maven2/org/apache/openejb/openejb-client/3.1.2/openejb-client-3.1.2.jar
195K downloaded
Downloading: http://repo.exist.com/maven2/org/apache/openejb/openejb-multicast/3.1.2/openejb-multicast-3.1.2.jar
27K downloaded
[INFO] [enforcer:enforce {execution: default}]
[INFO] [remote-resources:process {execution: default}]
[WARNING] org.apache.velocity.runtime.exception.ReferenceException: reference : template =
META-INF/DEPENDENCIES.vm [line 40,column 14] : $license.name is not a valid reference.
[WARNING] org.apache.velocity.runtime.exception.ReferenceException: reference : template =
META-INF/DEPENDENCIES.vm [line 40,column 14] : $license.name is not a valid reference.
[INFO] [resources:resources]
[INFO] Using 'UTF-8' encoding to copy filtered resources.
[INFO] Copying 1 resource
[INFO] skip non existing resourceDirectory /home/geronimo/geronimo/2.2/plugins/openejb/geronimo-openejb/src/main/filtered-resources
[INFO] Copying 3 resources
[INFO] [compiler:compile]
[INFO] Compiling 30 source files to /home/geronimo/geronimo/2.2/plugins/openejb/geronimo-openejb/target/classes
[INFO] ------------------------------------------------------------------------
[ERROR] BUILD FAILURE
[INFO] ------------------------------------------------------------------------
[INFO] Compilation failure

/home/geronimo/geronimo/2.2/plugins/openejb/geronimo-openejb/src/main/java/org/apache/geronimo/openejb/GeronimoSecurityService.java:[53,45]
[deprecation] login(java.lang.String,javax.security.auth.callback.CallbackHandler) in org.apache.geronimo.security.ContextManager
has been deprecated

/home/geronimo/geronimo/2.2/plugins/openejb/geronimo-openejb/src/main/java/org/apache/geronimo/openejb/EjbModuleImplGBean.java:[35,8]
cannot find symbol
symbol  : constructor EjbModuleImpl(java.lang.String,org.apache.geronimo.management.J2EEServer,org.apache.geronimo.management.J2EEApplication,java.lang.String,java.util.Collection<capture
of ? extends org.apache.geronimo.management.EJB>,java.lang.ClassLoader,org.apache.geronimo.openejb.OpenEjbSystem,org.apache.openejb.assembler.classic.EjbJarInfo)
location: class org.apache.geronimo.openejb.EjbModuleImpl

/home/geronimo/geronimo/2.2/plugins/openejb/geronimo-openejb/src/main/java/org/apache/geronimo/openejb/EjbModuleImplGBean.java:[39,8]
cannot find symbol
symbol  : method start()
location: class org.apache.geronimo.openejb.EjbModuleImplGBean

/home/geronimo/geronimo/2.2/plugins/openejb/geronimo-openejb/src/main/java/org/apache/geronimo/openejb/EjbModuleImplGBean.java:[42,16]
doStop() in org.apache.geronimo.openejb.EjbModuleImplGBean cannot override doStop() in org.apache.geronimo.openejb.EjbModuleImpl;
overridden method does not throw java.lang.Exception

/home/geronimo/geronimo/2.2/plugins/openejb/geronimo-openejb/src/main/java/org/apache/geronimo/openejb/EjbModuleImplGBean.java:[43,8]
cannot find symbol
symbol  : method stop()
location: class org.apache.geronimo.openejb.EjbModuleImplGBean

/home/geronimo/geronimo/2.2/plugins/openejb/geronimo-openejb/src/main/java/org/apache/geronimo/openejb/EjbModuleImplGBean.java:[47,8]
cannot find symbol
symbol  : method stop()
location: class org.apache.geronimo.openejb.EjbModuleImplGBean

/home/geronimo/geronimo/2.2/plugins/openejb/geronimo-openejb/src/main/java/org/apache/geronimo/openejb/EjbDeploymentGBean.java:[78,8]
cannot find symbol
symbol  : method start()
location: class org.apache.geronimo.openejb.EjbDeploymentGBean


[INFO] ------------------------------------------------------------------------
[INFO] Trace
org.apache.maven.BuildFailureException: Compilation failure
	at org.apache.maven.lifecycle.DefaultLifecycleExecutor.executeGoals(DefaultLifecycleExecutor.java:580)
	at org.apache.maven.lifecycle.DefaultLifecycleExecutor.executeGoalWithLifecycle(DefaultLifecycleExecutor.java:500)
	at org.apache.maven.lifecycle.DefaultLifecycleExecutor.executeGoal(DefaultLifecycleExecutor.java:479)
	at org.apache.maven.lifecycle.DefaultLifecycleExecutor.executeGoalAndHandleFailures(DefaultLifecycleExecutor.java:331)
	at org.apache.maven.lifecycle.DefaultLifecycleExecutor.executeTaskSegments(DefaultLifecycleExecutor.java:292)
	at org.apache.maven.lifecycle.DefaultLifecycleExecutor.execute(DefaultLifecycleExecutor.java:142)
	at org.apache.maven.DefaultMaven.doExecute(DefaultMaven.java:336)
	at org.apache.maven.DefaultMaven.execute(DefaultMaven.java:129)
	at org.apache.maven.cli.MavenCli.main(MavenCli.java:301)
	at sun.reflect.NativeMethodAccessorImpl.invoke0(Native Method)
	at sun.reflect.NativeMethodAccessorImpl.invoke(NativeMethodAccessorImpl.java:79)
	at sun.reflect.DelegatingMethodAccessorImpl.invoke(DelegatingMethodAccessorImpl.java:43)
	at java.lang.reflect.Method.invoke(Method.java:618)
	at org.codehaus.classworlds.Launcher.launchEnhanced(Launcher.java:315)
	at org.codehaus.classworlds.Launcher.launch(Launcher.java:255)
	at org.codehaus.classworlds.Launcher.mainWithExitCode(Launcher.java:430)
	at org.codehaus.classworlds.Launcher.main(Launcher.java:375)
Caused by: org.apache.maven.plugin.CompilationFailureException: Compilation failure
	at org.apache.maven.plugin.AbstractCompilerMojo.execute(AbstractCompilerMojo.java:516)
	at org.apache.maven.plugin.CompilerMojo.execute(CompilerMojo.java:114)
	at org.apache.maven.plugin.DefaultPluginManager.executeMojo(DefaultPluginManager.java:453)
	at org.apache.maven.lifecycle.DefaultLifecycleExecutor.executeGoals(DefaultLifecycleExecutor.java:559)
	... 16 more
[INFO] ------------------------------------------------------------------------
[INFO] Total time: 18 minutes 47 seconds
[INFO] Finished at: Tue Oct 27 20:23:37 EDT 2009
[INFO] Final Memory: 254M/579M
[INFO] ------------------------------------------------------------------------

Mime
View raw message