geronimo-dev mailing list archives

Site index · List index
Message view « Date » · « Thread »
Top « Date » · « Thread »
From ga...@apache.org
Subject [BUILD] trunk: Failed for Revision: 824884
Date Tue, 13 Oct 2009 19:21:09 GMT
Geronimo Revision: 824884 built with tests included
 
See the full build-1500.log file at http://people.apache.org/builds/geronimo/server/binaries/trunk/20091013/build-1500.log
 
 
See the unit test reports at http://people.apache.org/builds/geronimo/server/binaries/trunk/20091013/unit-test-reports
 
[INFO] [remote-resources:process {execution: default}]
[INFO] [site:attach-descriptor]
[INFO] [ianal:verify-legal-files {execution: default}]
[INFO] [install:install]
[INFO] Installing /home/geronimo/geronimo/trunk/plugins/openjpa2/pom.xml to /home/geronimo/.m2/repository/org/apache/geronimo/plugins/openjpa2/3.0-SNAPSHOT/openjpa2-3.0-SNAPSHOT.pom
[INFO] ------------------------------------------------------------------------
[INFO] Building Geronimo Plugins, OpenJPA2 :: Persistence 2.0
[INFO]    task-segment: [install]
[INFO] ------------------------------------------------------------------------
[INFO] [genesis:validate-configuration {execution: default}]
[INFO] snapshot org.apache.openjpa:openjpa:2.0.0-SNAPSHOT: checking for updates from codehaus.snapshots
[INFO] snapshot org.apache.openjpa:openjpa:2.0.0-SNAPSHOT: checking for updates from apache.snapshots
Downloading: http://repository.apache.org/snapshots/org/apache/openjpa/openjpa/2.0.0-SNAPSHOT/openjpa-2.0.0-SNAPSHOT.pom
11K downloaded
[INFO] snapshot org.apache.openjpa:openjpa-parent:2.0.0-SNAPSHOT: checking for updates from
codehaus.snapshots
[INFO] snapshot org.apache.openjpa:openjpa-parent:2.0.0-SNAPSHOT: checking for updates from
apache.snapshots
Downloading: http://repository.apache.org/snapshots/org/apache/openjpa/openjpa-parent/2.0.0-SNAPSHOT/openjpa-parent-2.0.0-SNAPSHOT.pom
38K downloaded
Downloading: http://repo.exist.com/maven2/net/sourceforge/serp/serp/1.11.0/serp-1.11.0.pom
4K downloaded
Downloading: http://repository.apache.org/snapshots/org/apache/openjpa/openjpa/2.0.0-SNAPSHOT/openjpa-2.0.0-SNAPSHOT.jar
3825K downloaded
Downloading: http://repo.exist.com/maven2/net/sourceforge/serp/serp/1.11.0/serp-1.11.0.jar
185K downloaded
[INFO] [enforcer:enforce {execution: default}]
[INFO] [remote-resources:process {execution: default}]
[INFO] [resources:resources]
[INFO] Using 'UTF-8' encoding to copy filtered resources.
[INFO] skip non existing resourceDirectory /home/geronimo/geronimo/trunk/plugins/openjpa2/geronimo-persistence-jpa20/src/main/resources
[INFO] skip non existing resourceDirectory /home/geronimo/geronimo/trunk/plugins/openjpa2/geronimo-persistence-jpa20/src/main/filtered-resources
[INFO] Copying 3 resources
[INFO] [compiler:compile]
[INFO] Compiling 10 source files to /home/geronimo/geronimo/trunk/plugins/openjpa2/geronimo-persistence-jpa20/target/classes
[INFO] [resources:testResources]
[INFO] Using 'UTF-8' encoding to copy filtered resources.
[INFO] skip non existing resourceDirectory /home/geronimo/geronimo/trunk/plugins/openjpa2/geronimo-persistence-jpa20/src/test/resources
[INFO] skip non existing resourceDirectory /home/geronimo/geronimo/trunk/plugins/openjpa2/geronimo-persistence-jpa20/src/test/filtered-resources
[INFO] Copying 3 resources
[INFO] [compiler:testCompile]
[INFO] Compiling 4 source files to /home/geronimo/geronimo/trunk/plugins/openjpa2/geronimo-persistence-jpa20/target/test-classes
[WARNING] /home/geronimo/geronimo/trunk/plugins/openjpa2/geronimo-persistence-jpa20/src/test/java/org/apache/geronimo/persistence/PersistenceUnitGBeanTest.java:[51,41]
[deprecation] toURL() in java.io.File has been deprecated

[INFO] [surefire:test]
[INFO] Surefire report directory: /home/geronimo/geronimo/trunk/plugins/openjpa2/geronimo-persistence-jpa20/target/surefire-reports

-------------------------------------------------------
 T E S T S
-------------------------------------------------------
Running org.apache.geronimo.persistence.CMPEntityManagerTest
Tests run: 9, Failures: 0, Errors: 0, Skipped: 0, Time elapsed: 0.106 sec
Running org.apache.geronimo.persistence.PersistenceUnitGBeanTest
Tests run: 2, Failures: 0, Errors: 1, Skipped: 0, Time elapsed: 0.165 sec <<< FAILURE!

Results :

Tests in error: 
  testNonNullJavaFileUrls(org.apache.geronimo.persistence.PersistenceUnitGBeanTest)

Tests run: 11, Failures: 0, Errors: 1, Skipped: 0

[INFO] ------------------------------------------------------------------------
[ERROR] BUILD FAILURE
[INFO] ------------------------------------------------------------------------
[INFO] There are test failures.

Please refer to /home/geronimo/geronimo/trunk/plugins/openjpa2/geronimo-persistence-jpa20/target/surefire-reports
for the individual test results.
[INFO] ------------------------------------------------------------------------
[INFO] Trace
org.apache.maven.BuildFailureException: There are test failures.

Please refer to /home/geronimo/geronimo/trunk/plugins/openjpa2/geronimo-persistence-jpa20/target/surefire-reports
for the individual test results.
	at org.apache.maven.lifecycle.DefaultLifecycleExecutor.executeGoals(DefaultLifecycleExecutor.java:580)
	at org.apache.maven.lifecycle.DefaultLifecycleExecutor.executeGoalWithLifecycle(DefaultLifecycleExecutor.java:500)
	at org.apache.maven.lifecycle.DefaultLifecycleExecutor.executeGoal(DefaultLifecycleExecutor.java:479)
	at org.apache.maven.lifecycle.DefaultLifecycleExecutor.executeGoalAndHandleFailures(DefaultLifecycleExecutor.java:331)
	at org.apache.maven.lifecycle.DefaultLifecycleExecutor.executeTaskSegments(DefaultLifecycleExecutor.java:292)
	at org.apache.maven.lifecycle.DefaultLifecycleExecutor.execute(DefaultLifecycleExecutor.java:142)
	at org.apache.maven.DefaultMaven.doExecute(DefaultMaven.java:336)
	at org.apache.maven.DefaultMaven.execute(DefaultMaven.java:129)
	at org.apache.maven.cli.MavenCli.main(MavenCli.java:301)
	at sun.reflect.NativeMethodAccessorImpl.invoke0(Native Method)
	at sun.reflect.NativeMethodAccessorImpl.invoke(NativeMethodAccessorImpl.java:39)
	at sun.reflect.DelegatingMethodAccessorImpl.invoke(DelegatingMethodAccessorImpl.java:25)
	at java.lang.reflect.Method.invoke(Method.java:597)
	at org.codehaus.classworlds.Launcher.launchEnhanced(Launcher.java:315)
	at org.codehaus.classworlds.Launcher.launch(Launcher.java:255)
	at org.codehaus.classworlds.Launcher.mainWithExitCode(Launcher.java:430)
	at org.codehaus.classworlds.Launcher.main(Launcher.java:375)
Caused by: org.apache.maven.plugin.MojoFailureException: There are test failures.

Please refer to /home/geronimo/geronimo/trunk/plugins/openjpa2/geronimo-persistence-jpa20/target/surefire-reports
for the individual test results.
	at org.apache.maven.plugin.surefire.SurefirePlugin.execute(SurefirePlugin.java:575)
	at org.apache.maven.plugin.DefaultPluginManager.executeMojo(DefaultPluginManager.java:453)
	at org.apache.maven.lifecycle.DefaultLifecycleExecutor.executeGoals(DefaultLifecycleExecutor.java:559)
	... 16 more
[INFO] ------------------------------------------------------------------------
[INFO] Total time: 13 minutes 15 seconds
[INFO] Finished at: Tue Oct 13 15:16:29 EDT 2009
[INFO] Final Memory: 444M/593M
[INFO] ------------------------------------------------------------------------

Mime
View raw message