geronimo-dev mailing list archives

Site index · List index
Message view « Date » · « Thread »
Top « Date » · « Thread »
From ga...@apache.org
Subject [BUILD] trunk: Failed for Revision: 824733
Date Tue, 13 Oct 2009 13:42:15 GMT
Geronimo Revision: 824733 built with tests included
 
See the full build-0900.log file at http://people.apache.org/builds/geronimo/server/binaries/trunk/20091013/build-0900.log
 
 
See the unit test reports at http://people.apache.org/builds/geronimo/server/binaries/trunk/20091013/unit-test-reports
 
[WARNING] Component returned which is not the same manager. Ignored. component=org.apache.maven.profiles.activation.OperatingSystemProfileActivator@78147814
[WARNING] Component returned which is not the same manager. Ignored. component=org.apache.maven.profiles.activation.AlwaysOnProfileActivator@6c1c6c1c
[WARNING] Component returned which is not the same manager. Ignored. component=org.apache.maven.profiles.activation.OperatingSystemProfileActivator@78147814
[WARNING] Component returned which is not the same manager. Ignored. component=org.apache.maven.profiles.activation.AlwaysOnProfileActivator@6c1c6c1c
[WARNING] Component returned which is not the same manager. Ignored. component=org.apache.maven.profiles.activation.OperatingSystemProfileActivator@78147814
[WARNING] Component returned which is not the same manager. Ignored. component=org.apache.maven.profiles.activation.AlwaysOnProfileActivator@6c1c6c1c
[WARNING] Component returned which is not the same manager. Ignored. component=org.apache.maven.profiles.activation.OperatingSystemProfileActivator@78147814
[WARNING] Component returned which is not the same manager. Ignored. component=org.apache.maven.profiles.activation.AlwaysOnProfileActivator@6c1c6c1c
[WARNING] Component returned which is not the same manager. Ignored. component=org.apache.maven.profiles.activation.OperatingSystemProfileActivator@78147814
[WARNING] Component returned which is not the same manager. Ignored. component=org.apache.maven.profiles.activation.AlwaysOnProfileActivator@6c1c6c1c
[WARNING] Component returned which is not the same manager. Ignored. component=org.apache.maven.profiles.activation.OperatingSystemProfileActivator@78147814
[WARNING] Component returned which is not the same manager. Ignored. component=org.apache.maven.profiles.activation.AlwaysOnProfileActivator@6c1c6c1c
[INFO] [compiler:testCompile]
[INFO] Compiling 4 source files to /home/geronimo/geronimo/trunk/plugins/openjpa2/geronimo-persistence-jpa20/target/test-classes
[WARNING] /home/geronimo/geronimo/trunk/plugins/openjpa2/geronimo-persistence-jpa20/src/test/java/org/apache/geronimo/persistence/PersistenceUnitGBeanTest.java:[51,41]
[deprecation] toURL() in java.io.File has been deprecated

[WARNING] Component returned which is not the same manager. Ignored. component=org.apache.maven.profiles.activation.OperatingSystemProfileActivator@78147814
[WARNING] Component returned which is not the same manager. Ignored. component=org.apache.maven.profiles.activation.AlwaysOnProfileActivator@6c1c6c1c
[WARNING] Component returned which is not the same manager. Ignored. component=org.apache.maven.profiles.activation.OperatingSystemProfileActivator@78147814
[WARNING] Component returned which is not the same manager. Ignored. component=org.apache.maven.profiles.activation.AlwaysOnProfileActivator@6c1c6c1c
[WARNING] Component returned which is not the same manager. Ignored. component=org.apache.maven.profiles.activation.OperatingSystemProfileActivator@78147814
[WARNING] Component returned which is not the same manager. Ignored. component=org.apache.maven.profiles.activation.AlwaysOnProfileActivator@6c1c6c1c
[WARNING] Component returned which is not the same manager. Ignored. component=org.apache.maven.profiles.activation.OperatingSystemProfileActivator@78147814
[WARNING] Component returned which is not the same manager. Ignored. component=org.apache.maven.profiles.activation.AlwaysOnProfileActivator@6c1c6c1c
[WARNING] Component returned which is not the same manager. Ignored. component=org.apache.maven.profiles.activation.OperatingSystemProfileActivator@78147814
[WARNING] Component returned which is not the same manager. Ignored. component=org.apache.maven.profiles.activation.AlwaysOnProfileActivator@6c1c6c1c
[WARNING] Component returned which is not the same manager. Ignored. component=org.apache.maven.profiles.activation.OperatingSystemProfileActivator@78147814
[WARNING] Component returned which is not the same manager. Ignored. component=org.apache.maven.profiles.activation.AlwaysOnProfileActivator@6c1c6c1c
[WARNING] Component returned which is not the same manager. Ignored. component=org.apache.maven.profiles.activation.OperatingSystemProfileActivator@78147814
[WARNING] Component returned which is not the same manager. Ignored. component=org.apache.maven.profiles.activation.AlwaysOnProfileActivator@6c1c6c1c
[WARNING] Component returned which is not the same manager. Ignored. component=org.apache.maven.profiles.activation.OperatingSystemProfileActivator@78147814
[WARNING] Component returned which is not the same manager. Ignored. component=org.apache.maven.profiles.activation.AlwaysOnProfileActivator@6c1c6c1c
[WARNING] Component returned which is not the same manager. Ignored. component=org.apache.maven.profiles.activation.OperatingSystemProfileActivator@78147814
[WARNING] Component returned which is not the same manager. Ignored. component=org.apache.maven.profiles.activation.AlwaysOnProfileActivator@6c1c6c1c
[WARNING] Component returned which is not the same manager. Ignored. component=org.apache.maven.profiles.activation.OperatingSystemProfileActivator@78147814
[WARNING] Component returned which is not the same manager. Ignored. component=org.apache.maven.profiles.activation.AlwaysOnProfileActivator@6c1c6c1c
[WARNING] Component returned which is not the same manager. Ignored. component=org.apache.maven.profiles.activation.OperatingSystemProfileActivator@78147814
[WARNING] Component returned which is not the same manager. Ignored. component=org.apache.maven.profiles.activation.AlwaysOnProfileActivator@6c1c6c1c
[WARNING] Component returned which is not the same manager. Ignored. component=org.apache.maven.profiles.activation.OperatingSystemProfileActivator@78147814
[WARNING] Component returned which is not the same manager. Ignored. component=org.apache.maven.profiles.activation.AlwaysOnProfileActivator@6c1c6c1c
[INFO] [surefire:test]
[WARNING] Component returned which is not the same manager. Ignored. component=org.apache.maven.profiles.activation.OperatingSystemProfileActivator@78147814
[WARNING] Component returned which is not the same manager. Ignored. component=org.apache.maven.profiles.activation.AlwaysOnProfileActivator@6c1c6c1c
[INFO] Surefire report directory: /home/geronimo/geronimo/trunk/plugins/openjpa2/geronimo-persistence-jpa20/target/surefire-reports

-------------------------------------------------------
 T E S T S
-------------------------------------------------------
Running org.apache.geronimo.persistence.CMPEntityManagerTest
Tests run: 9, Failures: 0, Errors: 0, Skipped: 0, Time elapsed: 0.159 sec
Running org.apache.geronimo.persistence.PersistenceUnitGBeanTest
Tests run: 2, Failures: 0, Errors: 1, Skipped: 0, Time elapsed: 0.21 sec <<< FAILURE!

Results :

Tests in error: 
  testNonNullJavaFileUrls(org.apache.geronimo.persistence.PersistenceUnitGBeanTest)

Tests run: 11, Failures: 0, Errors: 1, Skipped: 0

[INFO] ------------------------------------------------------------------------
[ERROR] BUILD FAILURE
[INFO] ------------------------------------------------------------------------
[INFO] There are test failures.

Please refer to /home/geronimo/geronimo/trunk/plugins/openjpa2/geronimo-persistence-jpa20/target/surefire-reports
for the individual test results.
[INFO] ------------------------------------------------------------------------
[INFO] Trace
org.apache.maven.BuildFailureException: There are test failures.

Please refer to /home/geronimo/geronimo/trunk/plugins/openjpa2/geronimo-persistence-jpa20/target/surefire-reports
for the individual test results.
	at org.apache.maven.lifecycle.DefaultLifecycleExecutor.executeGoals(DefaultLifecycleExecutor.java:580)
	at org.apache.maven.lifecycle.DefaultLifecycleExecutor.executeGoalWithLifecycle(DefaultLifecycleExecutor.java:500)
	at org.apache.maven.lifecycle.DefaultLifecycleExecutor.executeGoal(DefaultLifecycleExecutor.java:479)
	at org.apache.maven.lifecycle.DefaultLifecycleExecutor.executeGoalAndHandleFailures(DefaultLifecycleExecutor.java:331)
	at org.apache.maven.lifecycle.DefaultLifecycleExecutor.executeTaskSegments(DefaultLifecycleExecutor.java:292)
	at org.apache.maven.lifecycle.DefaultLifecycleExecutor.execute(DefaultLifecycleExecutor.java:142)
	at org.apache.maven.DefaultMaven.doExecute(DefaultMaven.java:336)
	at org.apache.maven.DefaultMaven.execute(DefaultMaven.java:129)
	at org.apache.maven.cli.MavenCli.main(MavenCli.java:301)
	at sun.reflect.NativeMethodAccessorImpl.invoke0(Native Method)
	at sun.reflect.NativeMethodAccessorImpl.invoke(NativeMethodAccessorImpl.java:39)
	at sun.reflect.DelegatingMethodAccessorImpl.invoke(DelegatingMethodAccessorImpl.java:37)
	at java.lang.reflect.Method.invoke(Method.java:599)
	at org.codehaus.classworlds.Launcher.launchEnhanced(Launcher.java:315)
	at org.codehaus.classworlds.Launcher.launch(Launcher.java:255)
	at org.codehaus.classworlds.Launcher.mainWithExitCode(Launcher.java:430)
	at org.codehaus.classworlds.Launcher.main(Launcher.java:375)
Caused by: org.apache.maven.plugin.MojoFailureException: There are test failures.

Please refer to /home/geronimo/geronimo/trunk/plugins/openjpa2/geronimo-persistence-jpa20/target/surefire-reports
for the individual test results.
	at org.apache.maven.plugin.surefire.SurefirePlugin.execute(SurefirePlugin.java:575)
	at org.apache.maven.plugin.DefaultPluginManager.executeMojo(DefaultPluginManager.java:453)
	at org.apache.maven.lifecycle.DefaultLifecycleExecutor.executeGoals(DefaultLifecycleExecutor.java:559)
	... 16 more
[INFO] ------------------------------------------------------------------------
[INFO] Total time: 20 minutes 42 seconds
[INFO] Finished at: Tue Oct 13 09:36:42 EDT 2009
[INFO] Final Memory: 587M/1360M
[INFO] ------------------------------------------------------------------------

Mime
View raw message