geronimo-dev mailing list archives

Site index · List index
Message view « Date » · « Thread »
Top « Date » · « Thread »
From ga...@apache.org
Subject [BUILD] trunk: Failed for Revision: 822546
Date Wed, 07 Oct 2009 01:34:14 GMT
Geronimo Revision: 822546 built with tests included
 
See the full build-2100.log file at http://people.apache.org/builds/geronimo/server/binaries/trunk/20091006/build-2100.log
 
 
See the unit test reports at http://people.apache.org/builds/geronimo/server/binaries/trunk/20091006/unit-test-reports
 
[WARNING] Component returned which is not the same manager. Ignored. component=org.apache.maven.profiles.activation.AlwaysOnProfileActivator@141c141c
[INFO] Surefire report directory: /home/geronimo/geronimo/trunk/plugins/tomcat/geronimo-tomcat6/target/surefire-reports
21:28:25,235 INFO  [JACCSecurityTest] Initialized
21:28:25,243 INFO  [ContainerTest] Initialized
21:28:25,244 INFO  [TomcatServerGBeanTest] Initialized
21:28:25,244 INFO  [TomcatServerGBeanTest] Initialized
21:28:25,245 INFO  [ApplicationTest] Initialized
21:28:25,246 INFO  [StatTest] Initialized
21:28:25,247 INFO  [JAASSecurityTest] Initialized

-------------------------------------------------------
 T E S T S
-------------------------------------------------------
Running org.apache.geronimo.tomcat.StatTest
Tests run: 1, Failures: 0, Errors: 0, Skipped: 0, Time elapsed: 7.382 sec
Running org.apache.geronimo.tomcat.JACCSecurityTest
Tests run: 1, Failures: 0, Errors: 0, Skipped: 0, Time elapsed: 4.199 sec
Running org.apache.geronimo.tomcat.JAASSecurityTest
Tests run: 1, Failures: 0, Errors: 0, Skipped: 0, Time elapsed: 2.513 sec
Running org.apache.geronimo.tomcat.BasicTest
Tests run: 1, Failures: 0, Errors: 0, Skipped: 0, Time elapsed: 0.139 sec
Running org.apache.geronimo.tomcat.ApplicationTest
Tests run: 1, Failures: 0, Errors: 0, Skipped: 0, Time elapsed: 3.273 sec
Running org.apache.geronimo.tomcat.TomcatServerGBeanTest
Tests run: 2, Failures: 0, Errors: 0, Skipped: 0, Time elapsed: 4.422 sec
Running org.apache.geronimo.tomcat.ContainerTest
Tests run: 1, Failures: 0, Errors: 0, Skipped: 0, Time elapsed: 3.612 sec

Results :

Tests run: 8, Failures: 0, Errors: 0, Skipped: 0

[INFO] [jar:jar]
[INFO] Building jar: /home/geronimo/geronimo/trunk/plugins/tomcat/geronimo-tomcat6/target/geronimo-tomcat6-3.0-SNAPSHOT.jar
[INFO] [ianal:verify-legal-files {execution: default}]
[INFO] Checking legal files in: geronimo-tomcat6-3.0-SNAPSHOT.jar
[INFO] [install:install]
[INFO] Installing /home/geronimo/geronimo/trunk/plugins/tomcat/geronimo-tomcat6/target/geronimo-tomcat6-3.0-SNAPSHOT.jar
to /home/geronimo/.m2/repository/org/apache/geronimo/modules/geronimo-tomcat6/3.0-SNAPSHOT/geronimo-tomcat6-3.0-SNAPSHOT.jar
[INFO] ------------------------------------------------------------------------
[INFO] Building Geronimo Plugins, Tomcat :: Tomcat
[INFO]    task-segment: [install]
[INFO] ------------------------------------------------------------------------
[INFO] [genesis:validate-configuration {execution: default}]
[INFO] [enforcer:enforce {execution: default}]
[INFO] [remote-resources:process {execution: default}]
[INFO] [resources:resources]
[INFO] Using 'UTF-8' encoding to copy filtered resources.
[INFO] Copying 5 resources
[INFO] Copying 3 resources
[INFO] Copying 3 resources
[INFO] [car:validate-configuration]
[INFO] [car:prepare-plan]
[WARNING] Component returned which is not the same manager. Ignored. component=org.apache.maven.profiles.activation.AlwaysOnProfileActivator@141c141c
[INFO] Generated: /home/geronimo/geronimo/trunk/plugins/tomcat/tomcat6/target/work/plan.xml
[INFO] [car:verify-no-dependency-change]
[WARNING] Component returned which is not the same manager. Ignored. component=org.apache.maven.profiles.activation.AlwaysOnProfileActivator@141c141c
[INFO] ------------------------------------------------------------------------
[ERROR] BUILD FAILURE
[INFO] ------------------------------------------------------------------------
[INFO] Dependencies have changed:
	Added dependencies are saved here: /home/geronimo/geronimo/trunk/plugins/tomcat/tomcat6/src/main/history/dependencies.added.xml
	Tree listing is saved here: /home/geronimo/geronimo/trunk/plugins/tomcat/tomcat6/src/main/history/treeListing.txt
Delete /home/geronimo/geronimo/trunk/plugins/tomcat/tomcat6/src/main/history/dependencies.xml
if you are happy with the dependency changes.
[INFO] ------------------------------------------------------------------------
[INFO] Trace
org.apache.maven.BuildFailureException: Dependencies have changed:
	Added dependencies are saved here: /home/geronimo/geronimo/trunk/plugins/tomcat/tomcat6/src/main/history/dependencies.added.xml
	Tree listing is saved here: /home/geronimo/geronimo/trunk/plugins/tomcat/tomcat6/src/main/history/treeListing.txt
Delete /home/geronimo/geronimo/trunk/plugins/tomcat/tomcat6/src/main/history/dependencies.xml
if you are happy with the dependency changes.
	at org.apache.maven.lifecycle.DefaultLifecycleExecutor.executeGoals(DefaultLifecycleExecutor.java:580)
	at org.apache.maven.lifecycle.DefaultLifecycleExecutor.executeGoalWithLifecycle(DefaultLifecycleExecutor.java:500)
	at org.apache.maven.lifecycle.DefaultLifecycleExecutor.executeGoal(DefaultLifecycleExecutor.java:479)
	at org.apache.maven.lifecycle.DefaultLifecycleExecutor.executeGoalAndHandleFailures(DefaultLifecycleExecutor.java:331)
	at org.apache.maven.lifecycle.DefaultLifecycleExecutor.executeTaskSegments(DefaultLifecycleExecutor.java:292)
	at org.apache.maven.lifecycle.DefaultLifecycleExecutor.execute(DefaultLifecycleExecutor.java:142)
	at org.apache.maven.DefaultMaven.doExecute(DefaultMaven.java:336)
	at org.apache.maven.DefaultMaven.execute(DefaultMaven.java:129)
	at org.apache.maven.cli.MavenCli.main(MavenCli.java:301)
	at sun.reflect.NativeMethodAccessorImpl.invoke0(Native Method)
	at sun.reflect.NativeMethodAccessorImpl.invoke(NativeMethodAccessorImpl.java:39)
	at sun.reflect.DelegatingMethodAccessorImpl.invoke(DelegatingMethodAccessorImpl.java:37)
	at java.lang.reflect.Method.invoke(Method.java:599)
	at org.codehaus.classworlds.Launcher.launchEnhanced(Launcher.java:315)
	at org.codehaus.classworlds.Launcher.launch(Launcher.java:255)
	at org.codehaus.classworlds.Launcher.mainWithExitCode(Launcher.java:430)
	at org.codehaus.classworlds.Launcher.main(Launcher.java:375)
Caused by: org.apache.maven.plugin.MojoFailureException: Dependencies have changed:
	Added dependencies are saved here: /home/geronimo/geronimo/trunk/plugins/tomcat/tomcat6/src/main/history/dependencies.added.xml
	Tree listing is saved here: /home/geronimo/geronimo/trunk/plugins/tomcat/tomcat6/src/main/history/treeListing.txt
Delete /home/geronimo/geronimo/trunk/plugins/tomcat/tomcat6/src/main/history/dependencies.xml
if you are happy with the dependency changes.
	at org.apache.geronimo.mavenplugins.car.DependencyChangeMojo.saveDependencyChanges(DependencyChangeMojo.java:155)
	at org.apache.geronimo.mavenplugins.car.DependencyChangeMojo.execute(DependencyChangeMojo.java:114)
	at org.apache.maven.plugin.DefaultPluginManager.executeMojo(DefaultPluginManager.java:453)
	at org.apache.maven.lifecycle.DefaultLifecycleExecutor.executeGoals(DefaultLifecycleExecutor.java:559)
	... 16 more
[INFO] ------------------------------------------------------------------------
[INFO] Total time: 27 minutes 8 seconds
[INFO] Finished at: Tue Oct 06 21:29:03 EDT 2009
[INFO] Final Memory: 729M/1024M
[INFO] ------------------------------------------------------------------------

Mime
View raw message