geronimo-dev mailing list archives

Site index · List index
Message view « Date » · « Thread »
Top « Date » · « Thread »
From ga...@apache.org
Subject [BUILD] trunk: Failed for Revision: 818206
Date Wed, 23 Sep 2009 19:50:02 GMT
Geronimo Revision: 818206 built with tests included
 
See the full build-1500.log file at http://people.apache.org/builds/geronimo/server/binaries/trunk/20090923/build-1500.log
 
 
See the unit test reports at http://people.apache.org/builds/geronimo/server/binaries/trunk/20090923/unit-test-reports
 
[INFO] [ianal:verify-legal-files {execution: default}]
[INFO] Checking legal files in: plugin-console-tomcat-3.0-SNAPSHOT.car
[INFO] [install:install]
[INFO] Installing /home/geronimo/geronimo/trunk/plugins/console/plugin-console-tomcat/target/plugin-console-tomcat-3.0-SNAPSHOT.car
to /home/geronimo/.m2/repository/org/apache/geronimo/plugins/plugin-console-tomcat/3.0-SNAPSHOT/plugin-console-tomcat-3.0-SNAPSHOT.car
[INFO] [car:update-pluginlist]
[INFO] ------------------------------------------------------------------------
[INFO] Building Geronimo Plugins, Corba
[INFO]    task-segment: [install]
[INFO] ------------------------------------------------------------------------
[INFO] [genesis:validate-configuration {execution: default}]
[INFO] [enforcer:enforce {execution: default}]
[INFO] [remote-resources:process {execution: default}]
[INFO] [site:attach-descriptor]
[INFO] [ianal:verify-legal-files {execution: default}]
[INFO] [install:install]
[INFO] Installing /home/geronimo/geronimo/trunk/plugins/corba/pom.xml to /home/geronimo/.m2/repository/org/apache/geronimo/plugins/corba/3.0-SNAPSHOT/corba-3.0-SNAPSHOT.pom
[INFO] ------------------------------------------------------------------------
[INFO] Building Geronimo Plugins, Corba :: Core
[INFO]    task-segment: [install]
[INFO] ------------------------------------------------------------------------
[INFO] [genesis:validate-configuration {execution: default}]
[INFO] [enforcer:enforce {execution: default}]
[INFO] [remote-resources:process {execution: default}]
[INFO] [resources:resources]
[INFO] Using 'UTF-8' encoding to copy filtered resources.
[INFO] skip non existing resourceDirectory /home/geronimo/geronimo/trunk/plugins/corba/geronimo-corba/src/main/resources
[INFO] skip non existing resourceDirectory /home/geronimo/geronimo/trunk/plugins/corba/geronimo-corba/src/main/filtered-resources
[INFO] Copying 3 resources
[INFO] [compiler:compile]
[INFO] Compiling 127 source files to /home/geronimo/geronimo/trunk/plugins/corba/geronimo-corba/target/classes
[WARNING] /home/geronimo/geronimo/trunk/plugins/corba/geronimo-corba/src/main/java/org/apache/geronimo/corba/util/Util.java:[47,38]
[deprecation] org.apache.geronimo.crypto.asn1.DERInputStream in org.apache.geronimo.crypto.asn1
has been deprecated

[WARNING] /home/geronimo/geronimo/trunk/plugins/corba/geronimo-corba/src/main/java/org/apache/geronimo/corba/security/config/tss/TSSGSSUPMechConfig.java:[108,53]
[deprecation] login(java.lang.String,javax.security.auth.callback.CallbackHandler) in org.apache.geronimo.security.ContextManager
has been deprecated

[WARNING] /home/geronimo/geronimo/trunk/plugins/corba/geronimo-corba/src/main/java/org/apache/geronimo/corba/util/DynamicStubClassLoaderGBean.java:[32,19]
[deprecation] addOperation(java.lang.String,java.lang.Class[]) in org.apache.geronimo.gbean.GBeanInfoBuilder
has been deprecated

[WARNING] /home/geronimo/geronimo/trunk/plugins/corba/geronimo-corba/src/main/java/org/apache/geronimo/corba/util/Util.java:[162,8]
[deprecation] org.apache.geronimo.crypto.asn1.DERInputStream in org.apache.geronimo.crypto.asn1
has been deprecated

[WARNING] /home/geronimo/geronimo/trunk/plugins/corba/geronimo-corba/src/main/java/org/apache/geronimo/corba/util/Util.java:[162,33]
[deprecation] org.apache.geronimo.crypto.asn1.DERInputStream in org.apache.geronimo.crypto.asn1
has been deprecated

[WARNING] /home/geronimo/geronimo/trunk/plugins/corba/geronimo-corba/src/main/java/org/apache/geronimo/corba/util/Util.java:[162,29]
[deprecation] DERInputStream(java.io.InputStream) in org.apache.geronimo.crypto.asn1.DERInputStream
has been deprecated

[WARNING] /home/geronimo/geronimo/trunk/plugins/corba/geronimo-corba/src/main/java/org/apache/geronimo/corba/TSSBeanGBean.java:[38,19]
[deprecation] addOperation(java.lang.String,java.lang.Class[]) in org.apache.geronimo.gbean.GBeanInfoBuilder
has been deprecated

[WARNING] /home/geronimo/geronimo/trunk/plugins/corba/geronimo-corba/src/main/java/org/apache/geronimo/corba/TSSBeanGBean.java:[39,19]
[deprecation] addOperation(java.lang.String,java.lang.Class[]) in org.apache.geronimo.gbean.GBeanInfoBuilder
has been deprecated

[WARNING] /home/geronimo/geronimo/trunk/plugins/corba/geronimo-corba/src/main/java/org/apache/geronimo/corba/CSSBeanGBean.java:[45,19]
[deprecation] addOperation(java.lang.String,java.lang.Class[]) in org.apache.geronimo.gbean.GBeanInfoBuilder
has been deprecated

[INFO] [resources:testResources]
[INFO] Using 'UTF-8' encoding to copy filtered resources.
[INFO] Copying 3 resources
[INFO] skip non existing resourceDirectory /home/geronimo/geronimo/trunk/plugins/corba/geronimo-corba/src/test/filtered-resources
[INFO] Copying 3 resources
[INFO] [compiler:testCompile]
[INFO] Compiling 18 source files to /home/geronimo/geronimo/trunk/plugins/corba/geronimo-corba/target/test-classes
[INFO] ------------------------------------------------------------------------
[ERROR] BUILD FAILURE
[INFO] ------------------------------------------------------------------------
[INFO] Compilation failure

/home/geronimo/geronimo/trunk/plugins/corba/geronimo-corba/src/test/java/org/apache/geronimo/corba/compiler/Special.java:[42,26]
unmappable character for encoding UTF-8

/home/geronimo/geronimo/trunk/plugins/corba/geronimo-corba/src/test/java/org/apache/geronimo/corba/compiler/Special.java:[42,27]
unmappable character for encoding UTF-8

/home/geronimo/geronimo/trunk/plugins/corba/geronimo-corba/src/test/java/org/apache/geronimo/corba/compiler/Special.java:[42,28]
unmappable character for encoding UTF-8

/home/geronimo/geronimo/trunk/plugins/corba/geronimo-corba/src/test/java/org/apache/geronimo/corba/compiler/Special.java:[42,29]
unmappable character for encoding UTF-8


[INFO] ------------------------------------------------------------------------
[INFO] Trace
org.apache.maven.BuildFailureException: Compilation failure
	at org.apache.maven.lifecycle.DefaultLifecycleExecutor.executeGoals(DefaultLifecycleExecutor.java:580)
	at org.apache.maven.lifecycle.DefaultLifecycleExecutor.executeGoalWithLifecycle(DefaultLifecycleExecutor.java:500)
	at org.apache.maven.lifecycle.DefaultLifecycleExecutor.executeGoal(DefaultLifecycleExecutor.java:479)
	at org.apache.maven.lifecycle.DefaultLifecycleExecutor.executeGoalAndHandleFailures(DefaultLifecycleExecutor.java:331)
	at org.apache.maven.lifecycle.DefaultLifecycleExecutor.executeTaskSegments(DefaultLifecycleExecutor.java:292)
	at org.apache.maven.lifecycle.DefaultLifecycleExecutor.execute(DefaultLifecycleExecutor.java:142)
	at org.apache.maven.DefaultMaven.doExecute(DefaultMaven.java:336)
	at org.apache.maven.DefaultMaven.execute(DefaultMaven.java:129)
	at org.apache.maven.cli.MavenCli.main(MavenCli.java:301)
	at sun.reflect.NativeMethodAccessorImpl.invoke0(Native Method)
	at sun.reflect.NativeMethodAccessorImpl.invoke(NativeMethodAccessorImpl.java:39)
	at sun.reflect.DelegatingMethodAccessorImpl.invoke(DelegatingMethodAccessorImpl.java:25)
	at java.lang.reflect.Method.invoke(Method.java:597)
	at org.codehaus.classworlds.Launcher.launchEnhanced(Launcher.java:315)
	at org.codehaus.classworlds.Launcher.launch(Launcher.java:255)
	at org.codehaus.classworlds.Launcher.mainWithExitCode(Launcher.java:430)
	at org.codehaus.classworlds.Launcher.main(Launcher.java:375)
Caused by: org.apache.maven.plugin.CompilationFailureException: Compilation failure
	at org.apache.maven.plugin.AbstractCompilerMojo.execute(AbstractCompilerMojo.java:516)
	at org.apache.maven.plugin.TestCompilerMojo.execute(TestCompilerMojo.java:102)
	at org.apache.maven.plugin.DefaultPluginManager.executeMojo(DefaultPluginManager.java:453)
	at org.apache.maven.lifecycle.DefaultLifecycleExecutor.executeGoals(DefaultLifecycleExecutor.java:559)
	... 16 more
[INFO] ------------------------------------------------------------------------
[INFO] Total time: 42 minutes 36 seconds
[INFO] Finished at: Wed Sep 23 15:44:59 EDT 2009
[INFO] Final Memory: 450M/671M
[INFO] ------------------------------------------------------------------------

Mime
View raw message