geronimo-dev mailing list archives

Site index · List index
Message view « Date » · « Thread »
Top « Date » · « Thread »
From ga...@apache.org
Subject [BUILD] trunk: Failed for Revision: 817982
Date Wed, 23 Sep 2009 08:25:27 GMT
Geronimo Revision: 817982 built with tests included
 
See the full build-0300.log file at http://people.apache.org/builds/geronimo/server/binaries/trunk/20090923/build-0300.log
 
 
See the unit test reports at http://people.apache.org/builds/geronimo/server/binaries/trunk/20090923/unit-test-reports
 
[INFO] Copying 3 resources
[INFO] [compiler:testCompile]
[INFO] Compiling 12 source files to /home/geronimo/geronimo/trunk/plugins/jetty7/geronimo-jetty7/target/test-classes
[WARNING] /home/geronimo/geronimo/trunk/plugins/jetty7/geronimo-jetty7/src/test/java/org/apache/geronimo/jetty7/ClassLoaderTest.java:[50,77]
[deprecation] toURL() in java.io.File has been deprecated

[INFO] [surefire:test]
[INFO] Surefire report directory: /home/geronimo/geronimo/trunk/plugins/jetty7/geronimo-jetty7/target/surefire-reports

-------------------------------------------------------
 T E S T S
-------------------------------------------------------
Running org.apache.geronimo.jetty7.ApplicationTest
Tests run: 2, Failures: 0, Errors: 0, Skipped: 0, Time elapsed: 3.308 sec
Running org.apache.geronimo.jetty7.connector.ConnectorGBeanTest
Tests run: 1, Failures: 0, Errors: 0, Skipped: 0, Time elapsed: 0.045 sec
Running org.apache.geronimo.jetty7.GBeanInfoTest
Tests run: 2, Failures: 0, Errors: 0, Skipped: 0, Time elapsed: 0.075 sec
Running org.apache.geronimo.jetty7.SecurityTest
Tests run: 1, Failures: 0, Errors: 0, Skipped: 0, Time elapsed: 1.011 sec
Running org.apache.geronimo.jetty7.ClassLoaderTest
Tests run: 9, Failures: 0, Errors: 0, Skipped: 0, Time elapsed: 0.033 sec
Running org.apache.geronimo.jetty7.ContainerTest
Tests run: 3, Failures: 0, Errors: 0, Skipped: 0, Time elapsed: 3.052 sec
Running org.apache.geronimo.jetty7.StatTest
Tests run: 2, Failures: 0, Errors: 0, Skipped: 0, Time elapsed: 10.075 sec
Running org.apache.geronimo.jetty7.connector.HTTPConnectorTest
Tests run: 1, Failures: 0, Errors: 0, Skipped: 0, Time elapsed: 0.004 sec
Running org.apache.geronimo.jetty7.security.BuiltInAuthMethodTest
Tests run: 1, Failures: 0, Errors: 0, Skipped: 0, Time elapsed: 0.005 sec

Results :

Tests run: 22, Failures: 0, Errors: 0, Skipped: 0

[INFO] [jar:jar]
[INFO] Building jar: /home/geronimo/geronimo/trunk/plugins/jetty7/geronimo-jetty7/target/geronimo-jetty7-3.0-SNAPSHOT.jar
[INFO] [ianal:verify-legal-files {execution: default}]
[INFO] Checking legal files in: geronimo-jetty7-3.0-SNAPSHOT.jar
[INFO] [install:install]
[INFO] Installing /home/geronimo/geronimo/trunk/plugins/jetty7/geronimo-jetty7/target/geronimo-jetty7-3.0-SNAPSHOT.jar
to /home/geronimo/.m2/repository/org/apache/geronimo/modules/geronimo-jetty7/3.0-SNAPSHOT/geronimo-jetty7-3.0-SNAPSHOT.jar
[INFO] ------------------------------------------------------------------------
[INFO] Building Geronimo Plugins, Jetty :: Jetty 7
[INFO]    task-segment: [install]
[INFO] ------------------------------------------------------------------------
[INFO] [genesis:validate-configuration {execution: default}]
[INFO] [enforcer:enforce {execution: default}]
[INFO] [remote-resources:process {execution: default}]
[INFO] [resources:resources]
[INFO] Using 'UTF-8' encoding to copy filtered resources.
[INFO] skip non existing resourceDirectory /home/geronimo/geronimo/trunk/plugins/jetty7/jetty7/src/main/resources
[INFO] skip non existing resourceDirectory /home/geronimo/geronimo/trunk/plugins/jetty7/jetty7/src/main/filtered-resources
[INFO] Copying 3 resources
[INFO] [car:validate-configuration]
[INFO] [car:prepare-plan]
[INFO] Generated: /home/geronimo/geronimo/trunk/plugins/jetty7/jetty7/target/work/plan.xml
[INFO] [car:verify-no-dependency-change]
[INFO] ------------------------------------------------------------------------
[ERROR] BUILD FAILURE
[INFO] ------------------------------------------------------------------------
[INFO] Dependencies have changed:
	Removed dependencies are saved here: /home/geronimo/geronimo/trunk/plugins/jetty7/jetty7/src/main/history/dependencies.removed.xml
	Tree listing is saved here: /home/geronimo/geronimo/trunk/plugins/jetty7/jetty7/src/main/history/treeListing.txt
Delete /home/geronimo/geronimo/trunk/plugins/jetty7/jetty7/src/main/history/dependencies.xml
if you are happy with the dependency changes.
[INFO] ------------------------------------------------------------------------
[INFO] Trace
org.apache.maven.BuildFailureException: Dependencies have changed:
	Removed dependencies are saved here: /home/geronimo/geronimo/trunk/plugins/jetty7/jetty7/src/main/history/dependencies.removed.xml
	Tree listing is saved here: /home/geronimo/geronimo/trunk/plugins/jetty7/jetty7/src/main/history/treeListing.txt
Delete /home/geronimo/geronimo/trunk/plugins/jetty7/jetty7/src/main/history/dependencies.xml
if you are happy with the dependency changes.
	at org.apache.maven.lifecycle.DefaultLifecycleExecutor.executeGoals(DefaultLifecycleExecutor.java:580)
	at org.apache.maven.lifecycle.DefaultLifecycleExecutor.executeGoalWithLifecycle(DefaultLifecycleExecutor.java:500)
	at org.apache.maven.lifecycle.DefaultLifecycleExecutor.executeGoal(DefaultLifecycleExecutor.java:479)
	at org.apache.maven.lifecycle.DefaultLifecycleExecutor.executeGoalAndHandleFailures(DefaultLifecycleExecutor.java:331)
	at org.apache.maven.lifecycle.DefaultLifecycleExecutor.executeTaskSegments(DefaultLifecycleExecutor.java:292)
	at org.apache.maven.lifecycle.DefaultLifecycleExecutor.execute(DefaultLifecycleExecutor.java:142)
	at org.apache.maven.DefaultMaven.doExecute(DefaultMaven.java:336)
	at org.apache.maven.DefaultMaven.execute(DefaultMaven.java:129)
	at org.apache.maven.cli.MavenCli.main(MavenCli.java:301)
	at sun.reflect.NativeMethodAccessorImpl.invoke0(Native Method)
	at sun.reflect.NativeMethodAccessorImpl.invoke(NativeMethodAccessorImpl.java:39)
	at sun.reflect.DelegatingMethodAccessorImpl.invoke(DelegatingMethodAccessorImpl.java:25)
	at java.lang.reflect.Method.invoke(Method.java:597)
	at org.codehaus.classworlds.Launcher.launchEnhanced(Launcher.java:315)
	at org.codehaus.classworlds.Launcher.launch(Launcher.java:255)
	at org.codehaus.classworlds.Launcher.mainWithExitCode(Launcher.java:430)
	at org.codehaus.classworlds.Launcher.main(Launcher.java:375)
Caused by: org.apache.maven.plugin.MojoFailureException: Dependencies have changed:
	Removed dependencies are saved here: /home/geronimo/geronimo/trunk/plugins/jetty7/jetty7/src/main/history/dependencies.removed.xml
	Tree listing is saved here: /home/geronimo/geronimo/trunk/plugins/jetty7/jetty7/src/main/history/treeListing.txt
Delete /home/geronimo/geronimo/trunk/plugins/jetty7/jetty7/src/main/history/dependencies.xml
if you are happy with the dependency changes.
	at org.apache.geronimo.mavenplugins.car.DependencyChangeMojo.saveDependencyChanges(DependencyChangeMojo.java:155)
	at org.apache.geronimo.mavenplugins.car.DependencyChangeMojo.execute(DependencyChangeMojo.java:114)
	at org.apache.maven.plugin.DefaultPluginManager.executeMojo(DefaultPluginManager.java:453)
	at org.apache.maven.lifecycle.DefaultLifecycleExecutor.executeGoals(DefaultLifecycleExecutor.java:559)
	... 16 more
[INFO] ------------------------------------------------------------------------
[INFO] Total time: 78 minutes 54 seconds
[INFO] Finished at: Wed Sep 23 04:21:24 EDT 2009
[INFO] Final Memory: 247M/560M
[INFO] ------------------------------------------------------------------------

Mime
View raw message